program: Gaussian 09
title: 000266949
version: EM64L-G09RevD.01
frameworkgroup: C1[X(C18H16ClNO3)]
method: RPBEPBE
basis: SDD
operation: Freq
keyword: #p
keyword: freq=noraman
keyword: PBEPBE/SDD
title: #p freq=noraman PBEPBE/SDD
converged: YES YES NO NO
title: Mulliken charges:
elementType: Cl O O O N C C C C C C C C C C C C C C C C C C H H H H H H H H H H H H H H H H
charge: -0.033919 -0.439392 -0.245202 -0.213155 -0.426516 -0.492752 0.439154 0.472358 -0.428649 -0.376862 -0.367226 -0.438585 0.507488 -0.391713 -0.379347 0.251853 -0.346692 -0.320790 -0.272536 0.115044 -0.318651 0.238982 -0.711056 0.233731 0.231652 0.310471 0.244324 0.263478 0.237723 0.224086 0.225313 0.238511 0.275673 0.278714 0.269015 0.212553 0.272317 0.272337 0.388266
chargesum: 0.00000
title: Mulliken charges with hydrogens summed into heavy atoms:
elementType: Cl O O O N C C C C C C C C C C C C C C C C C C
charge: -0.033919 -0.051126 -0.245202 -0.213155 -0.116045 -0.027369 0.439154 0.472358 -0.184324 -0.113384 -0.129502 -0.214499 0.507488 -0.166400 -0.140836 0.251853 -0.071019 -0.042077 -0.003521 0.115044 -0.106098 0.238982 -0.166402
polarizability: 5.39019666e+02 4.96227167e-01 1.79594561e+02 -1.68779590e+01 5.43568930e+00 1.22691200e+02
1716.lowfreq: -4.8988 -2.5424 -2.2008 -0.0016 -0.0015 -0.0010 8.1379 18.3465 20.8659
frequency: 7.0156 18.0759 20.6833 26.9122 46.2857 50.8245 57.5959 74.6803 104.6338 115.1077 124.0079 142.3182 176.0463 190.1157 213.4833 223.0833 262.9183 284.3161 308.9843 365.4832 379.6758 406.4298 414.1052 418.3768 450.2677 478.1931 485.7993 502.9443 515.8667 533.2864 547.2652 589.3327 598.8740 631.0661 636.0400 656.6799 689.8402 714.8014 730.4655 732.0215 753.3092 802.5887 810.0528 818.6716 825.3241 846.1084 852.5065 868.1210 871.7075 917.0487 927.0105 948.6976 960.1130 981.8828 995.5226 998.1208 1001.4354 1004.2147 1007.2006 1027.4841 1082.4575 1088.5419 1120.1040 1132.4089 1138.4898 1149.9799 1192.3416 1192.7459 1209.9772 1220.4159 1231.2537 1259.1377 1282.0885 1298.3681 1307.6720 1322.3393 1324.1405 1335.4137 1354.1495 1377.4069 1393.8933 1410.9707 1413.2547 1446.0681 1473.3851 1485.6107 1503.7985 1528.9377 1564.0154 1569.4068 1580.1281 1622.7201 1631.0416 1641.3023 1645.0075 2939.1262 2984.5454 3022.4599 3090.6901 3095.7004 3106.7281 3117.2232 3133.5297 3134.4349 3139.3008 3141.8263 3160.7933 3164.6330 3178.6763 3532.1050 3553.4491
redmass: 8.4807 4.0573 7.0686 5.5757 4.4774 5.2144 7.1777 6.2140 7.2470 4.6980 6.7026 3.1675 5.0316 7.5073 3.7411 5.7242 9.4381 5.4028 3.3577 3.1559 6.5334 2.7740 3.1452 3.5051 1.2695 4.6015 4.5276 2.4448 3.0557 6.0105 2.4331 2.6505 1.6024 6.9484 6.8027 6.5715 3.7447 4.2676 6.2768 3.1979 3.7487 4.2101 1.3695 1.6769 4.4221 3.1063 1.7804 1.2924 1.8132 1.9858 4.8049 1.3713 1.3601 1.5352 2.8041 1.5404 1.5209 3.5077 1.2454 2.7156 2.9970 3.2379 1.3619 1.5582 1.0954 1.7159 1.1461 1.1523 1.3395 1.8219 1.4300 1.3888 1.5098 1.5774 1.3363 2.5720 1.7025 1.7284 2.1685 3.5414 4.4514 2.8673 1.0868 3.7599 1.8202 1.1580 2.4086 3.2150 5.6803 5.5112 7.2815 6.3666 6.3814 5.9085 8.6905 1.0600 1.1002 1.0566 1.0901 1.1068 1.0894 1.0872 1.0896 1.0872 1.0901 1.0967 1.0956 1.0956 1.0953 1.0642 1.0770
irintensity: 2.3186 1.7807 1.7635 3.9310 3.1290 1.4889 0.0456 0.9795 0.4550 4.3621 0.6664 1.2821 0.8205 0.1091 0.2223 0.1545 3.5993 1.6224 0.6026 1.7420 7.9129 7.9810 4.4221 1.3361 201.9538 14.3015 6.3432 12.3413 22.1994 61.8420 4.4918 39.7744 52.4176 1.0150 1.0466 19.7001 68.5971 32.1797 75.4360 0.3588 20.6771 6.6912 0.3432 77.4906 2.9599 10.7644 4.6388 3.8265 37.6812 21.0681 2.5934 1.6719 1.1274 40.8775 0.5832 31.8345 7.3035 168.2006 33.6783 110.0227 226.8659 173.1614 7.8764 19.0350 1.1761 123.1709 112.5316 27.5287 21.4629 19.8860 5.9279 33.8538 53.5386 29.1668 23.2659 152.0474 3.8074 7.6087 7.2477 377.7286 2.2175 19.5066 23.5142 45.9957 12.7044 117.8347 4.8560 572.1133 629.6798 323.1456 7.3734 123.6413 542.2001 47.3751 239.7701 64.2323 20.5994 25.2234 0.3488 6.3539 15.6219 14.0733 8.4884 14.1686 11.1849 18.0987 21.3117 3.5749 1.0980 56.8630 108.9047
temp: 298.150 k
press: 1.00000 atm
elementType: 17 8 8 8 7 6 6 6 6 6 6 6 6 6 6 6 6 6 6 6 6 6 6 1 1 1 1 1 1 1 1 1 1 1 1 1 1 1 1
symmnumber: 1
zpe: 778560.9 jmol-1
zpe.correction: 0.296538 hartree
zpe.thermalcorrener: 0.318370 hartree
zpe.thermalcorrenthalpy: 0.319314 hartree
zpe.thermalcorrgfe: 0.239605 hartree
zpe.sumelectzpe: -1434.368208 hartree
zpe.sumelectthermal: -1434.346377 hartree
zpe.sumelectthermalent: -1434.345432 hartree
zpe.sumelectthermalfe: -1434.425142 hartree
dipole: 8.1953 -2.0026 0.7079
dipole: 8.4661
quadrupole: -222.2218 -131.5320 -140.6680
quadrupole: 29.3564 2.5496 -0.4521
quadrupole: -57.4145 33.2753 24.1393 29.3564 2.5496 -0.4521
hfenergy: -1434.6647465 hartree
pointgroup: C01 [X(C18H16Cl1N1O3)]
dipole: 3.2353888 0.7908101 -0.0362776 debye
polarizability: 538.4553812|-9.7060929|173.4415378|20.6230606|18.3995863|129.4085075 unknown
InChI: InChI=1S/C18H16ClNO3/c19-11-17(21)10-5-13-3-8-16(9-4-13)20-12-14-1-6-15(7-2-14)18(22)23/h1-10,20,22H,11-12H2
charge 0 multiplicity 1
39 atoms
Cl -9.807481 0.817796 -0.617019
O  7.738594 -0.935941 -1.504831
O  8.378416 0.352469 0.319089
O  -7.561924 -1.1938 -0.229526
N  0.972352 -0.32403 0.443346
C  1.765087 0.912863 0.434805
C  3.244436 0.620843 0.220296
C  -0.412941 -0.372068 0.341591
C  4.220325 1.179472 1.083166
C  3.666683 -0.193778 -0.863865
C  -1.203881 0.809251 0.171001
C  -1.08486 -1.633382 0.399617
C  -3.278372 -0.53303 0.099246
C  -2.597221 0.720389 0.050069
C  -2.477131 -1.703448 0.28115
C  6.005112 0.120149 -0.214468
C  5.591272 0.935976 0.868828
C  5.034918 -0.445938 -1.081808
C  -4.722855 -0.674172 -0.018916
C  7.462742 -0.112727 -0.401364
C  -5.664387 0.314387 -0.19683
C  -7.102599 -0.017924 -0.296016
C  -7.996738 1.220158 -0.490353
H  1.627495 1.487355 1.375987
H  1.400473 1.560076 -0.389638
H  1.465228 -1.184905 0.684458
H  3.904385 1.80406 1.926739
H  2.917286 -0.62092 -1.539891
H  -0.726823 1.793579 0.145773
H  -0.498868 -2.551041 0.533481
H  -3.171683 1.644629 -0.078385
H  -2.971348 -2.681455 0.327104
H  6.354449 1.361609 1.528295
H  5.364973 -1.069272 -1.917265
H  -5.124033 -1.697675 0.04029
H  -5.379328 1.372582 -0.269889
H  -7.882849 1.91082 0.362798
H  -7.721668 1.747241 -1.420071
H  8.723463 -1.053196 -1.579495
