program: Gaussian 09
title: 000266948
version: EM64L-G09RevD.01
frameworkgroup: C1[X(C6H8N4)]
method: RPBEPBE
basis: SDD
operation: Freq
keyword: #p
keyword: freq=noraman
keyword: PBEPBE/SDD
title: #p freq=noraman PBEPBE/SDD
converged: NO YES NO NO
title: Mulliken charges:
elementType: N N N N C C C C C C H H H H H H H H
charge: -0.171203 -0.246472 -0.060718 -0.033754 -0.522470 0.208947 0.149496 -0.614417 -0.371736 -0.344320 0.236459 0.256578 0.282715 0.241914 0.223943 0.267886 0.251936 0.245215
chargesum: 0.00000
title: Mulliken charges with hydrogens summed into heavy atoms:
elementType: N N N N C C C C C C
charge: -0.171203 0.036243 -0.060718 -0.033754 -0.029433 0.208947 0.149496 0.119326 -0.119799 -0.099105
polarizability: 1.24316117e+02 1.49597171e+00 9.53772565e+01 -2.07085919e+00 2.15023513e-01 4.92820319e+01
1716.lowfreq: -11.6455 -7.4447 -0.0002 0.0005 0.0009 11.6223 57.7895 131.9769 157.0416
frequency: 57.7560 131.9744 157.0400 198.4017 243.4676 247.0576 388.2137 451.4043 512.6411 556.7963 584.5691 659.4044 716.7684 756.7637 803.4370 837.4075 897.3746 926.6499 948.2440 980.3550 1045.5783 1055.2240 1110.1046 1125.4415 1144.7361 1186.4776 1226.6334 1246.6224 1288.6882 1289.8275 1350.5230 1395.4252 1413.7898 1422.6488 1462.6571 1470.8277 1477.5818 1508.3422 1539.2552 1589.9974 2971.4043 2988.9111 3049.6513 3057.8872 3105.6090 3137.1774 3159.9341 3309.5984
redmass: 2.8640 2.2604 1.3790 2.5865 3.5047 3.4714 3.6037 3.8693 7.7518 3.5095 6.4978 5.5523 7.2965 5.6989 3.2111 2.9258 1.4590 1.5868 1.4538 5.0028 1.5887 5.0346 4.1680 1.3937 1.5315 2.5968 1.6604 4.9632 1.4153 5.2975 1.6363 1.4139 1.2457 1.1267 1.1300 1.1196 1.1632 4.9988 3.3272 6.3983 1.0340 1.0639 1.1021 1.1011 1.0992 1.0930 1.0926 1.0768
irintensity: 4.1669 13.9363 0.5293 5.6192 3.8520 3.9145 0.8204 2.7854 5.3760 2.5637 3.6655 2.6542 9.5578 15.1362 79.4146 2.6392 18.0467 64.2159 5.4528 14.1392 12.8454 0.8863 4.2063 5.5677 18.5897 5.4969 5.5707 33.9721 38.5494 48.6612 30.3526 2.0075 58.6423 15.8378 29.1411 1.2128 45.1112 46.7149 70.9380 229.5880 88.5573 39.7353 32.1369 15.3962 4.5228 21.9599 21.0696 5.0222
temp: 298.150 k
press: 1.00000 atm
elementType: 7 7 7 7 6 6 6 6 6 6 1 1 1 1 1 1 1 1
symmnumber: 1
zpe: 371956.6 jmol-1
zpe.correction: 0.141671 hartree
zpe.thermalcorrener: 0.150250 hartree
zpe.thermalcorrenthalpy: 0.151194 hartree
zpe.thermalcorrgfe: 0.107796 hartree
zpe.sumelectzpe: -451.655141 hartree
zpe.sumelectthermal: -451.646562 hartree
zpe.sumelectthermalent: -451.645618 hartree
zpe.sumelectthermalfe: -451.689016 hartree
dipole: 3.4557 1.9406 -0.7169
dipole: 4.0276
quadrupole: -65.0971 -53.3871 -58.2262
quadrupole: -2.2289 -3.0451 -1.8596
quadrupole: -6.1936 5.5163 0.6773 -2.2289 -3.0451 -1.8596
hfenergy: -451.7968119 hartree
pointgroup: C01 [X(C6H8N4)]
dipole: 1.3630272 -0.7054033 0.3943349 debye
dipolederiv: -1.137135 -0.1581746 -0.1325963 -0.4782609 -0.0910443 -0.0305247 -0.2004543 -0.1443119 -0.286127 -0.4526762 -0.1170374 -0.0199817 -0.0739677 -0.1593593 -0.0745249 0.1259665 -0.0304887 0.0462087 -1.0190163 -0.1318348 -0.0721145 0.3835848 -0.3760336 0.030263 -0.1441651 -0.0101813 -0.2431829 -0.6966032 -0.055829 -0.035098 0.1914443 -0.77316 0.0039573 -0.0473318 0.0196725 -0.2206991 0.1223953 0.0331791 0.0386841 0.1006383 0.213957 0.0743493 0.0622088 0.0847597 0.306704 -0.4727382 -0.1258722 -0.0627527 -0.5589593 -0.2063103 -0.0241089 -0.059833 0.0201657 -0.0509263 1.5414311 0.1348203 0.1655824 0.1446851 0.0341883 0.0462669 0.2034849 0.0280525 0.1656308 0.3879166 0.2738267 -0.0337093 0.4766047 0.2357721 0.0266992 0.0547964 0.0380039 0.2701065 0.5933212 0.039041 0.0584632 -0.0901584 0.4383591 0.0010756 0.0870225 -0.0057642 -0.0604767 0.7115913 0.1582897 0.0730761 -0.0754387 0.6260326 -0.0114647 0.070681 0.0007239 -0.0389791 0.0473587 -0.0016124 -0.0154355 -0.0011489 -0.0583937 0.0759766 -0.0365954 0.1269748 0.0135813 0.0317281 0.0379342 0.0257562 0.0201639 0.0069148 -0.0749784 0.0280778 -0.1378367 -0.0840308 0.3228493 -0.0311999 0.0357716 0.0303085 0.0808859 -0.0051481 -0.1352064 0.0396899 -0.0609968 -0.0836515 -0.0746797 0.0988418 -0.0500606 0.0750155 -0.0665491 0.173972 0.0063727 -0.0580909 -0.0737982 -0.1034509 -0.0922725 -0.0825063 0.0663524 0.0038616 -0.1588755 -0.0559096 -0.0777374 0.0862544 0.0937865 -0.0161995 0.0194047 0.0042467 0.0208956 -0.0030454 0.0204119 0.1301286 0.0853928 -0.0602116 -0.0051441 -0.0589896 -0.0897724 -0.0080933 -0.0129792 -0.0090749 0.1262923 0.0053799 0.089025 -0.0108714 0.102656 -0.027651 0.0120469 -0.0077237 0.0087398 0.1225948 unknown
polarizability: 123.7637564|-0.3141221|95.2886052|7.1192718|-0.9799403|49.9230441 unknown
InChI: InChI=1S/C6H8N4/c1-10-6-5(3-9-10)2-7-4-8-6/h2,4,9H,3H2,1H3
charge 0 multiplicity 1
18 atoms
N  1.519371 0.444301 0.266371
N  2.083966 -0.909886 0.366781
N  -0.670263 1.483086 0.034675
N  -2.55673 -0.087676 -0.097263
C  0.937644 -1.849778 0.019037
C  -0.300157 -0.961774 0.067053
C  0.150707 0.399105 0.129056
C  2.399393 1.578942 0.026039
C  -1.674021 -1.160155 -0.037079
C  -2.000948 1.153581 -0.075882
H  0.919665 -2.694333 0.729779
H  1.092812 -2.258172 -0.99716
H  2.349129 -1.042123 1.361854
H  3.023713 1.405721 -0.870051
H  3.063393 1.766877 0.890921
H  1.758286 2.462388 -0.128971
H  -2.128665 -2.155186 -0.092393
H  -2.692997 1.997881 -0.155565
