program: Gaussian 09
title: 000266947
version: EM64L-G09RevD.01
frameworkgroup: C1[X(C16H11NO)]
method: RPBEPBE
basis: SDD
operation: Freq
keyword: #p
keyword: freq=noraman
keyword: PBEPBE/SDD
title: #p freq=noraman PBEPBE/SDD
converged: NO NO NO NO
title: Mulliken charges:
elementType: O N C C C C C C C C C C C C C C C C H H H H H H H H H H H
charge: -0.280744 -0.495987 0.366580 0.173272 0.443937 0.420134 -0.654893 0.336995 -0.610959 0.212217 -0.433504 -0.423493 -0.409754 -0.365614 -0.244325 -0.248686 -0.221879 -0.239848 0.233588 0.305696 0.262566 0.237589 0.242356 0.227251 0.255803 0.225439 0.226628 0.227932 0.231703
chargesum: 0.00000
title: Mulliken charges with hydrogens summed into heavy atoms:
elementType: O N C C C C C C C C C C C C C C C C
charge: -0.280744 -0.190291 0.366580 0.173272 0.443937 0.420134 -0.421305 0.336995 -0.348392 0.212217 -0.195915 -0.181137 -0.182504 -0.109811 -0.018886 -0.022058 0.006053 -0.008145
polarizability: 3.91970775e+02 -3.76636294e-02 1.76561677e+02 1.02854592e-02 4.83105014e-03 6.84595955e+01
1716.lowfreq: -0.0013 0.0003 0.0011 1.7762 7.1454 14.7233 39.7547 87.1552 125.7629
frequency: 39.7373 87.1545 125.7611 161.7424 188.1985 267.9262 281.4069 302.2193 308.8720 322.2822 424.8208 444.8943 448.0294 476.1706 493.6858 501.6666 536.7479 544.3343 555.3027 568.3195 617.4450 621.6632 680.1470 706.9061 709.5314 747.0916 753.3282 754.2020 764.6807 770.8817 839.5955 841.4157 853.8558 861.2981 873.8711 899.0784 915.5554 917.9305 954.8077 960.5393 982.4043 1023.0147 1028.9233 1086.2379 1100.4339 1142.0152 1167.3992 1170.9898 1183.1318 1196.0963 1225.7031 1254.8114 1265.2864 1273.1919 1308.4849 1323.4680 1371.9998 1410.4094 1412.7832 1433.7226 1449.1650 1477.6936 1498.1840 1501.6240 1525.5461 1591.6298 1599.7959 1606.4668 1618.6149 1652.9537 3115.7337 3117.4692 3121.0858 3123.0867 3139.8735 3143.8542 3155.2300 3158.6374 3160.1015 3175.4779 3577.7944
redmass: 6.3555 4.0425 6.0356 5.1710 4.6482 5.1647 4.1449 4.8664 7.0338 4.3981 2.7572 2.9350 4.7113 2.3195 1.4860 8.0255 8.3121 4.0797 3.6260 8.0834 6.7010 6.8503 4.6668 4.1483 6.6560 1.2399 5.3600 1.2443 6.1533 2.4594 1.3661 1.4050 5.7619 3.7622 1.4536 1.8754 5.3133 1.3764 1.4049 1.2971 1.3313 2.2632 2.0488 3.4360 1.9710 1.6824 1.0631 1.0796 2.8403 1.4349 1.4750 1.8975 2.0985 2.2242 1.9141 2.1685 3.7744 8.4109 3.0302 2.7808 2.8445 2.4418 3.6954 4.7840 3.3095 7.1902 5.1559 7.3345 6.4786 7.8595 1.0882 1.0890 1.0884 1.0885 1.0946 1.0884 1.0922 1.0934 1.1001 1.0999 1.0771
irintensity: 0.7703 0.2099 0.1634 0.4368 0.9710 0.1913 3.7193 0.6335 0.0089 0.2181 13.2341 11.3648 2.5918 2.0552 94.2643 0.0163 1.2235 0.3470 2.8644 10.2213 0.7248 1.5567 0.0128 0.4318 0.6647 105.3210 5.6000 65.4022 0.0661 1.5477 8.1018 1.0324 6.0715 19.4542 82.0166 1.4791 1.1844 7.1932 12.1023 0.0055 0.0019 7.4497 11.0382 11.0259 25.5578 17.9805 1.1354 1.6086 94.1297 3.8021 1.0389 28.3774 23.7335 9.5503 90.0891 114.6909 168.8247 1.4547 22.5009 7.1213 0.6402 40.4795 503.2604 377.8646 10.6531 8.3416 64.8500 79.0873 13.2109 11.0319 0.8889 18.4601 10.9844 0.3126 32.8712 7.2077 7.6682 20.3923 40.9328 17.4704 29.7658
temp: 298.150 k
press: 1.00000 atm
elementType: 8 7 6 6 6 6 6 6 6 6 6 6 6 6 6 6 6 6 1 1 1 1 1 1 1 1 1 1 1
symmnumber: 1
zpe: 586132.0 jmol-1
zpe.correction: 0.223246 hartree
zpe.thermalcorrener: 0.236034 hartree
zpe.thermalcorrenthalpy: 0.236979 hartree
zpe.thermalcorrgfe: 0.184121 hartree
zpe.sumelectzpe: -745.085064 hartree
zpe.sumelectthermal: -745.072275 hartree
zpe.sumelectthermalent: -745.071331 hartree
zpe.sumelectthermalfe: -745.124189 hartree
dipole: -0.7920 2.2497 0.0016
dipole: 2.3850
quadrupole: -91.5275 -87.9054 -112.3754
quadrupole: -3.1550 -0.0015 0.0052
quadrupole: 5.7420 9.3640 -15.1059 -3.1550 -0.0015 0.0052
hfenergy: -745.3083098 hartree
pointgroup: C01 [X(C16H11N1O1)]
dipole: -0.3112098 -0.8852223 -0.0006336 debye
polarizability: 391.9707004|0.132479|176.5617518|-0.0102876|0.0048265|68.4595955 unknown
InChI: InChI=1S/C16H11NO/c1-2-6-12-10-16-14(9-11(12)5-1)17-13-7-3-4-8-15(13)18-16/h1-10,17H
charge 0 multiplicity 1
29 atoms
O  -1.22366 1.409072 0.00006
N  -1.245062 -1.432187 0.000244
C  -0.004755 -0.767611 0.000061
C  -0.007345 0.677862 0.000091
C  2.462232 -0.726015 -0.000082
C  2.443277 0.720977 -0.000001
C  1.217996 -1.441535 -0.000017
C  -2.468768 -0.734851 0.000115
C  1.175487 1.39757 0.000079
C  -2.44658 0.68801 0.000125
C  3.726092 -1.402349 -0.000189
C  3.683204 1.436959 -0.000017
C  -3.718315 -1.395786 0.000139
C  -3.634331 1.432886 0.000154
C  4.923686 -0.679001 -0.000199
C  4.903339 0.751775 -0.000112
C  -4.920137 -0.649682 0.000122
C  -4.882404 0.763039 0.000147
H  1.238094 -2.538775 -0.000013
H  -1.257637 -2.451088 -0.000808
H  1.133032 2.491327 0.00009
H  3.741187 -2.499211 -0.000253
H  3.661615 2.533389 0.000046
H  -3.749966 -2.492304 0.000183
H  -3.569019 2.525131 0.00016
H  5.885475 -1.204063 -0.000277
H  5.848716 1.30544 -0.000114
H  -5.88032 -1.176121 0.000112
H  -5.810232 1.343541 0.000158
