program: Gaussian 09
title: 000266945
version: EM64L-G09RevD.01
frameworkgroup: C1[X(C21H22N6O5)]
method: RPBEPBE
basis: SDD
operation: Freq
keyword: #p
keyword: freq=noraman
keyword: PBEPBE/SDD
title: #p freq=noraman PBEPBE/SDD
converged: YES YES NO NO
title: Mulliken charges:
elementType: O O O O O N N N N N N C C C C C C C C C C C C C C C C C C C C C H H H H H H H H H H H H H H H H H H H H H H
charge: -0.304201 -0.418788 -0.408655 -0.223836 -0.253089 -0.428642 -0.432876 -0.088670 -0.119480 -0.637628 -0.589575 -0.037061 -0.550552 -0.528415 -0.506936 0.414567 0.160272 0.277753 0.482497 0.251263 -0.561385 0.199687 0.202544 -0.379198 -0.339934 0.067548 -0.364263 -0.370032 -0.445428 -0.345896 0.122325 -0.060235 0.293206 0.234103 0.281035 0.256945 0.313903 0.337513 0.221504 0.225580 0.309082 0.205312 0.269005 0.220144 0.253573 0.241724 0.219537 0.259795 0.379166 0.377171 0.334691 0.327760 0.326943 0.328623
chargesum: 0.00000
title: Mulliken charges with hydrogens summed into heavy atoms:
elementType: O O O O O N N N N N N C C C C C C C C C C C C C C C C C C C C C
charge: -0.304201 -0.039621 -0.031483 -0.223836 -0.253089 -0.091129 -0.123793 -0.088670 -0.119480 0.024823 0.065992 0.256145 -0.035413 0.042433 -0.059852 0.414567 0.160272 0.277753 0.482497 0.251263 -0.356073 0.199687 0.202544 -0.110194 -0.119790 0.067548 -0.110690 -0.128308 -0.225891 -0.086101 0.122325 -0.060235
polarizability: 5.21113333e+02 1.77812202e+01 2.23898445e+02 4.31813099e+01 -2.43672805e+01 2.34765081e+02
1716.lowfreq: -3.8136 -2.7168 -0.0010 0.0014 0.0016 3.2186 10.0523 14.4853 17.6837
frequency: 4.8498 13.9672 17.4553 22.5357 29.1971 38.2434 41.1706 42.9981 57.4210 64.2456 74.9459 84.0411 96.0136 123.6510 128.8511 152.4588 163.2932 175.0318 195.3380 204.9035 218.4183 227.1947 261.7058 293.6840 303.8325 314.5200 327.7909 356.1438 371.6801 379.4105 388.1816 403.3852 410.5030 416.2162 432.5212 449.1357 452.6423 469.3962 488.3884 500.7774 504.2473 507.6819 520.1943 524.7782 527.4548 530.8030 542.0737 549.2933 559.4353 570.1008 603.5957 627.2615 632.5522 645.9850 663.5112 670.8303 685.7407 694.0097 714.6620 720.3006 729.2329 755.6616 794.5185 810.3405 814.7820 818.3112 826.4068 834.1877 844.1550 857.1682 862.5395 878.5475 887.9946 894.8685 910.4123 924.9822 945.0463 980.1323 983.2248 989.8316 996.8211 999.5202 1034.7274 1044.5341 1058.1319 1079.6478 1087.7763 1106.5397 1110.1086 1127.1300 1131.3311 1142.1900 1151.1838 1196.0072 1205.0398 1207.1292 1210.8658 1220.9138 1248.3530 1263.8075 1276.7453 1278.3621 1287.9834 1300.4788 1305.9028 1312.8311 1339.0754 1341.0240 1341.7927 1357.8288 1368.8184 1380.8098 1385.5820 1396.5282 1433.5945 1435.5900 1459.8068 1463.0742 1466.0291 1471.6526 1481.9400 1492.1029 1510.5931 1528.1207 1540.9744 1553.8791 1559.7215 1588.1941 1602.4794 1626.3079 1632.0964 1636.9764 1654.2064 1673.1372 2929.7896 2975.2732 3001.7813 3030.7485 3035.4769 3057.1533 3104.0331 3109.6941 3111.5034 3129.4425 3135.8833 3144.3557 3164.7610 3168.5780 3506.1190 3507.9216 3554.6092 3555.3625 3560.6001 3562.5830 3710.7463 3723.0962
redmass: 6.3257 6.0016 6.5300 6.9895 7.8829 4.8226 8.4325 7.3758 8.0602 5.1270 6.1285 5.6268 5.5204 4.8198 6.2111 4.3100 4.7543 6.0754 5.1415 5.6878 3.2898 4.5430 4.6614 5.6259 4.0651 4.5374 3.9601 3.3549 1.3660 3.3116 5.2408 1.3592 2.6514 2.3281 2.3570 2.6872 1.3051 5.0830 2.8882 2.9041 2.6204 3.5931 2.4558 2.7002 1.9526 1.2481 3.2448 1.2125 4.9335 2.6961 1.9122 4.1953 6.7980 1.4034 4.8775 3.2172 3.5030 6.0774 4.5700 6.5460 5.5725 4.6841 3.7381 1.5308 3.0948 5.0281 2.8973 1.8829 2.6801 2.4655 4.7731 1.8656 2.2682 3.5693 2.3952 2.6316 1.3801 1.3575 1.3668 2.3994 2.4665 1.9008 2.6915 2.9472 1.8867 3.1352 4.0421 2.3357 2.2546 1.8468 1.4521 1.4488 2.0510 1.1404 1.3919 1.1531 1.3112 2.1385 1.6097 1.7442 1.7711 1.5490 1.4598 1.9968 4.4102 1.4081 1.8303 2.3383 1.6827 2.2159 3.4982 2.7830 1.4950 6.6576 1.1405 3.4517 1.3841 2.9701 1.8039 4.4421 1.6025 1.1550 2.7618 3.3700 5.1609 4.8972 5.1341 5.7085 1.5792 1.7549 3.9896 5.7889 7.7547 8.4685 1.0605 1.0997 1.0614 1.0791 1.0651 1.0986 1.0902 1.1035 1.0865 1.0894 1.0964 1.0872 1.0961 1.0957 1.0638 1.0639 1.0457 1.0775 1.0770 1.0442 1.1033 1.1059
irintensity: 0.3541 0.7357 0.3010 0.5411 2.7518 1.0914 0.3712 3.3684 0.8692 0.4988 1.8712 3.2635 2.0900 4.0005 3.6364 9.4761 1.2804 2.1992 0.1978 8.0940 4.6470 15.1184 0.1810 2.9755 2.2062 5.1422 4.8576 9.7972 67.0531 4.0970 0.7592 86.6930 10.6852 15.0586 89.6078 12.1188 271.6412 11.3608 12.4405 35.0702 7.1906 20.1768 29.2542 49.7105 89.5269 22.6671 77.2479 37.8141 18.6178 107.2919 63.8708 19.3946 2.2900 142.5867 21.1928 50.2592 25.7426 4.9994 27.7257 10.2926 9.1673 22.3694 10.0871 12.0680 2.9334 3.1354 17.8635 37.4309 30.9370 25.1580 7.2440 16.9756 6.4058 2.0482 30.4494 0.1179 0.1820 3.8366 1.4493 20.9480 0.5868 9.5411 4.4363 287.3738 140.8542 9.5198 18.9622 3.9617 65.8605 4.1774 35.4784 6.2710 44.1998 129.6686 34.1025 69.4852 3.1140 23.7705 0.5028 11.4400 239.2443 2.8806 86.8028 60.3137 13.0687 90.6151 35.0896 35.0732 74.1479 21.7000 185.0530 91.1238 96.6927 10.2182 50.0969 0.9155 532.7451 53.6315 53.3325 158.0727 369.9964 13.3348 75.9600 234.0608 277.9462 154.9198 153.4090 93.6871 790.6888 499.3873 275.4163 3.2085 170.5214 240.1364 59.1527 22.5146 19.3110 13.8550 4.7145 5.8157 20.1793 5.7557 18.1402 13.0838 18.5030 9.4562 17.0584 7.1123 17.9508 24.2741 84.2262 21.7799 95.1696 153.6137 33.9443 45.5993
temp: 298.150 k
press: 1.00000 atm
elementType: 8 8 8 8 8 7 7 7 7 7 7 6 6 6 6 6 6 6 6 6 6 6 6 6 6 6 6 6 6 6 6 6 1 1 1 1 1 1 1 1 1 1 1 1 1 1 1 1 1 1 1 1 1 1
symmnumber: 1
zpe: 1091105.0 jmol-1
zpe.correction: 0.415580 hartree
zpe.thermalcorrener: 0.445915 hartree
zpe.thermalcorrenthalpy: 0.446859 hartree
zpe.thermalcorrgfe: 0.347675 hartree
zpe.sumelectzpe: -1515.846072 hartree
zpe.sumelectthermal: -1515.815737 hartree
zpe.sumelectthermalent: -1515.814793 hartree
zpe.sumelectthermalfe: -1515.913977 hartree
dipole: -4.7699 -0.1615 -1.8020
dipole: 5.1015
quadrupole: -159.2835 -180.1775 -185.8183
quadrupole: 33.7770 -21.1698 -0.8182
quadrupole: 15.8096 -5.0844 -10.7252 33.7770 -21.1698 -0.8182
hfenergy: -1516.2616519 hartree
pointgroup: C01 [X(C21H22N6O5)]
dipole: 1.8857405 0.1357028 -0.6737639 debye
polarizability: 521.6955787|24.6220353|221.6479122|-37.8382417|23.2660747|236.433368 unknown
InChI: InChI=1S/C21H22N6O5/c22-19-15-7-11(1-6-16(15)26-21(23)27-19)10-24-13-4-2-12(3-5-13)20(32)25-14(8-17(28)29)9-18(30)31/h1-7,14,24-25,28,30H,8-10,22-23H2
charge 0 multiplicity 1
54 atoms
O  -4.734114 0.051608 2.218845
O  -5.811797 2.298535 -2.342588
O  -7.459669 -3.503216 -0.271045
O  -7.200942 3.221458 -0.725489
O  -6.244937 -2.132174 -1.68939
N  -5.108663 0.153448 -0.065852
N  1.425181 0.127909 0.150521
N  7.604269 -0.908317 -1.292651
N  8.507202 0.969128 0.011676
N  7.243461 2.18081 1.530742
N  9.829007 -0.214449 -1.503847
C  -6.56775 0.167218 0.11713
C  -7.252718 0.78352 -1.134133
C  -7.117221 -1.240804 0.460811
C  2.426874 -0.219786 1.171038
C  3.80309 -0.374485 0.54425
C  -4.257442 0.111299 1.033476
C  -2.789938 0.135342 0.756374
C  0.052021 0.136927 0.370453
C  6.153357 0.325023 0.30453
C  4.86375 0.473984 0.892668
C  -6.79934 2.213624 -1.344348
C  -6.875208 -2.278863 -0.615232
C  -1.907223 -0.208499 1.812285
C  -2.223696 0.504217 -0.497047
C  6.379357 -0.712251 -0.677321
C  4.034022 -1.40561 -0.425495
C  -0.514518 -0.212295 1.635446
C  -0.834672 0.506648 -0.689521
C  5.284716 -1.570297 -1.022226
C  7.310482 1.157634 0.611623
C  8.594441 -0.05889 -0.915892
H  -6.772679 0.803888 0.997484
H  -8.343449 0.793613 -0.9659
H  -7.027009 0.178349 -2.026433
H  -8.200819 -1.205248 0.681192
H  -6.624285 -1.57817 1.392691
H  -4.753437 -0.015573 -1.00833
H  2.460245 0.548394 1.974336
H  2.12398 -1.172361 1.654222
H  1.778428 0.47889 -0.740008
H  4.674442 1.262863 1.632943
H  -2.348888 -0.464861 2.781261
H  -2.863468 0.824516 -1.328628
H  3.20719 -2.073946 -0.694725
H  0.133112 -0.475696 2.476938
H  -0.418196 0.797824 -1.662043
H  5.471699 -2.355537 -1.760656
H  -5.515715 3.246254 -2.425682
H  -7.27073 -4.170475 -0.986307
H  8.089859 2.721781 1.697095
H  6.39544 2.401308 2.042216
H  10.58756 0.40719 -1.239353
H  9.956437 -0.952696 -2.190306
