program: Gaussian 09
title: 000266941
version: EM64L-G09RevD.01
frameworkgroup: C1[X(C10H12BrN5O4)]
method: RPBEPBE
basis: SDD
operation: Freq
keyword: #p
keyword: freq=noraman
keyword: PBEPBE/SDD
title: #p freq=noraman PBEPBE/SDD
converged: YES YES NO NO
title: Mulliken charges:
elementType: Br O O O O N N N N N C C C C C C C C C C H H H H H H H H H H H H
charge: 0.061339 -0.300726 -0.436276 -0.456884 -0.214319 -0.187110 -0.434607 0.058403 -0.050948 -0.635861 -0.081004 -0.469015 -0.186957 0.007375 -0.400027 0.359382 -0.200573 -0.153826 0.008278 0.137844 0.285528 0.249126 0.272871 0.241402 0.253558 0.242926 0.236403 0.359508 0.396742 0.359648 0.349257 0.328545
chargesum: 0.00000
title: Mulliken charges with hydrogens summed into heavy atoms:
elementType: Br O O O O N N N N N C C C C C C C C C C
charge: 0.061339 -0.300726 -0.076767 -0.097236 -0.214319 -0.187110 -0.037865 0.058403 -0.050948 0.041941 0.204524 0.052981 0.054445 0.260933 0.079302 0.359382 -0.200573 -0.153826 0.008278 0.137844
polarizability: 2.23131551e+02 1.36113527e+01 1.94129315e+02 -2.08461020e+00 1.57918707e+01 9.91935066e+01
1716.lowfreq: -4.1465 -0.0005 0.0005 0.0008 4.5776 8.2675 35.6771 47.0397 58.4052
frequency: 35.6766 47.0189 58.4022 72.7287 94.8193 102.8234 124.3020 134.5688 157.0952 188.3514 205.6712 216.6167 247.7086 264.3062 279.7833 291.8037 305.0779 307.7226 339.2492 356.7449 386.0861 396.8025 448.9225 453.4047 496.3253 520.4688 528.4692 539.9674 549.1504 605.4770 630.7553 644.8416 651.2704 693.1737 705.8303 719.3949 745.3001 768.0036 805.8574 820.4836 877.2347 932.2433 942.2174 957.3803 969.8292 992.3596 1007.4346 1026.9325 1038.9998 1046.0577 1068.7876 1115.2444 1151.7138 1161.2648 1183.2135 1198.7766 1208.2270 1228.1726 1250.2885 1266.5894 1287.4262 1290.7418 1308.0393 1314.0084 1331.1078 1341.1347 1350.9155 1382.1875 1388.1588 1413.7567 1415.9946 1452.5667 1461.9637 1514.0844 1528.0887 1599.0833 1619.0910 1639.0471 2961.2459 2989.3156 3015.0653 3041.6304 3063.3128 3105.1785 3115.0872 3455.7866 3538.6794 3566.1284 3586.2767 3697.4317
redmass: 7.6443 5.5291 6.8434 5.9009 6.8794 7.3410 6.7680 5.9814 6.1920 6.4153 3.7159 5.0420 9.6905 3.9340 1.5409 2.5573 1.9390 2.2112 5.3131 4.0895 1.3187 2.8162 4.8308 4.3328 8.9482 1.1836 5.7362 3.0381 5.3220 7.5941 7.7515 8.4091 4.8840 10.6246 4.5620 1.3031 4.4715 9.9456 2.8526 7.1710 2.5929 5.2759 3.6378 6.6147 4.9201 2.2706 1.8604 3.9143 4.0121 4.8858 3.0186 1.6028 3.6974 1.2867 3.7033 1.5974 1.2887 5.5469 1.3764 1.7740 1.2556 1.4455 1.2693 2.1136 1.5908 1.3729 1.2254 1.4171 5.9608 6.1299 1.6697 1.0828 1.0990 5.1481 4.5064 1.4893 10.2047 3.8371 1.0831 1.0864 1.0627 1.0607 1.0891 1.1034 1.1053 1.0799 1.0456 1.0666 1.0668 1.1052
irintensity: 1.3127 4.7246 1.2133 0.2045 1.9430 1.8649 4.5679 4.6338 3.8877 4.5703 9.1845 0.3100 3.9025 12.2851 85.4336 11.5188 132.7466 185.3236 11.9918 30.7866 44.4657 59.6106 5.1999 5.1958 6.4659 173.0608 15.1225 3.9445 2.9090 2.8858 3.8835 0.1231 6.1240 12.6949 7.1539 115.8965 38.8303 3.8150 10.1344 5.0571 39.1411 42.8117 41.7065 40.1079 21.9676 24.0512 61.9012 48.8390 63.8953 64.7820 14.3007 15.4278 59.4523 8.6787 4.7890 15.4922 27.8027 32.2273 14.3348 53.0260 5.6779 9.4524 19.4047 78.4982 18.4160 4.6343 23.6151 12.9560 253.4631 3.5942 3.2133 6.6497 13.9814 321.5327 131.1895 23.1372 633.3506 398.4097 6.3899 51.3346 34.0163 5.1790 14.1277 9.8353 13.4005 246.4599 105.4271 16.1457 17.8982 63.6802
temp: 298.150 k
press: 1.00000 atm
elementType: 35 8 8 8 8 7 7 7 7 7 6 6 6 6 6 6 6 6 6 6 1 1 1 1 1 1 1 1 1 1 1 1
symmnumber: 1
zpe: 612105.0 jmol-1
zpe.correction: 0.233138 hartree
zpe.thermalcorrener: 0.251945 hartree
zpe.thermalcorrenthalpy: 0.252890 hartree
zpe.thermalcorrgfe: 0.185361 hartree
zpe.sumelectzpe: -974.855669 hartree
zpe.sumelectthermal: -974.836862 hartree
zpe.sumelectthermalent: -974.835918 hartree
zpe.sumelectthermalfe: -974.903447 hartree
dipole: 2.0082 -14.5799 -2.0599
dipole: 14.8610
quadrupole: -108.2267 -149.4328 -127.6467
quadrupole: 4.8825 1.3644 -13.0781
quadrupole: 20.2087 -20.9974 0.7887 4.8825 1.3644 -13.0781
hfenergy: -975.0888073 hartree
pointgroup: C01 [X(C10H12Br1N5O4)]
dipole: -5.7208324 0.035382 1.2065148 debye
polarizability: 189.2870844|13.8222703|222.51302|-19.8868345|19.026093|104.6542692 unknown
InChI: InChI=1S/C10H12BrN5O4/c11-9-13-6-7(14-10(12)15-8(6)19)16(9)5-1-3(18)4(2-17)20-5/h3-5,14,17-18H,1-2,12H2
charge 0 multiplicity 1
32 atoms
Br 0.540022 -3.981976 -0.655929
O  -1.76378 -0.108737 1.034317
O  -3.895207 -0.595077 -1.857534
O  -2.360307 2.746263 0.622603
O  4.199324 0.731749 -1.315935
N  0.121135 -1.167144 0.026284
N  0.47691 1.288468 0.470528
N  2.166299 -1.592759 -0.929701
N  2.610657 2.142684 -0.30261
N  1.032735 3.560721 0.709636
C  -1.238994 -1.405448 0.595005
C  -2.273817 -1.949174 -0.441233
C  -3.374652 -0.840254 -0.516351
C  -2.589932 0.410552 -0.091966
C  -3.324993 1.637883 0.425889
C  0.841992 0.034332 0.014958
C  1.008929 -2.112336 -0.553825
C  2.084685 -0.22522 -0.588242
C  3.066143 0.866478 -0.782938
C  1.426411 2.309371 0.268526
H  -1.142098 -2.03468 1.494522
H  -2.671454 -2.928357 -0.132509
H  -1.810028 -2.051583 -1.436759
H  -4.193307 -1.049746 0.20272
H  -1.934503 0.699363 -0.942873
H  -3.752985 1.442577 1.422022
H  -4.129392 1.923887 -0.278122
H  -4.460575 -1.352804 -2.148687
H  -0.426755 1.445268 0.931826
H  -2.216867 3.206451 -0.243024
H  1.712936 4.310432 0.613727
H  0.157268 3.713518 1.206771
