program: Gaussian 09
title: 000266940
version: EM64L-G09RevD.01
frameworkgroup: C1[X(C10H13N5O6)]
method: RPBEPBE
basis: SDD
operation: Freq
keyword: #p
keyword: freq=noraman
keyword: PBEPBE/SDD
title: #p freq=noraman PBEPBE/SDD
converged: YES YES NO NO
title: Mulliken charges:
elementType: O O O O O O N N N N N C C C C C C C C C C H H H H H H H H H H H H H
charge: -0.283518 -0.410264 -0.520325 -0.445104 -0.441504 -0.198321 -0.232066 0.013692 -0.382287 -0.313838 0.001225 -0.190679 -0.165641 -0.155356 -0.085620 -0.354074 0.301277 0.119030 -0.108202 0.021390 -0.254374 0.332889 0.291334 0.280178 0.258858 0.228247 0.214621 0.362147 0.385398 0.393705 0.370943 0.330393 0.241169 0.394678
chargesum: 0.00000
title: Mulliken charges with hydrogens summed into heavy atoms:
elementType: O O O O O O N N N N N C C C C C C C C C C
charge: -0.283518 -0.048118 -0.134927 -0.074162 -0.046826 -0.198321 -0.232066 0.013692 0.011418 0.016556 0.001225 0.142210 0.125693 0.124822 0.173237 0.088794 0.301277 0.119030 -0.108202 0.021390 -0.013205
polarizability: 2.14263741e+02 -7.49116754e+00 1.72028383e+02 5.96852242e+00 -9.87677967e+00 1.12157025e+02
1716.lowfreq: -0.0012 -0.0010 -0.0008 3.3469 6.7725 11.9876 45.9454 54.7252 94.4006
frequency: 45.7669 54.7091 94.3771 105.2720 117.5400 137.9084 145.0315 165.5725 185.6851 199.2896 213.6298 219.1776 233.2202 259.6072 266.0693 284.7904 305.3480 340.5177 358.9044 380.1222 410.1408 411.4926 429.6807 465.1789 475.5644 500.6130 512.9785 526.0117 589.7378 598.8123 618.3184 651.1367 676.4211 713.9472 718.3218 726.3188 764.2420 766.2860 777.6978 792.6014 800.3753 850.2884 864.0010 894.9638 895.0519 904.5442 931.3465 941.5076 969.8363 980.9857 1005.7975 1019.9878 1022.9269 1035.0880 1058.6285 1073.1813 1121.6400 1154.6744 1198.4921 1222.5403 1227.3507 1241.9820 1254.7140 1265.8532 1275.7408 1292.9971 1297.7465 1319.5935 1339.4549 1352.0716 1357.7447 1359.4417 1367.4597 1382.2112 1391.1022 1401.5714 1429.4090 1461.6720 1498.4489 1511.3531 1548.9777 1598.1123 1629.1327 2993.6132 3042.6103 3049.6585 3073.9136 3078.1554 3108.3736 3124.5238 3226.5329 3363.0925 3442.9410 3470.3071 3524.3635 3614.9410
redmass: 7.7874 7.5134 7.5620 6.9221 6.9335 5.3220 4.1175 6.3711 3.8954 7.1043 5.3169 5.9131 1.2466 5.4584 5.0795 5.1475 7.8084 4.8032 5.7061 4.2439 1.9358 2.0237 1.3650 4.2894 4.6396 5.4936 4.5427 5.6048 8.6815 5.7022 7.8676 12.1246 3.9549 1.9011 2.8421 5.4702 3.1814 3.9627 10.5721 3.0846 1.8780 2.9152 3.0970 2.3540 2.1189 3.2205 3.9071 2.8171 5.3748 2.3151 4.8126 5.3395 3.3725 4.5107 2.7352 3.0069 2.2091 1.3786 1.1846 2.4839 1.4788 1.7938 1.8681 2.1863 1.4405 1.9743 1.7352 1.2087 1.4223 2.2539 1.2812 1.3593 1.3182 1.1791 1.2175 1.8158 1.3076 1.0859 5.6915 7.6490 2.3975 3.6361 12.1603 1.0570 1.0882 1.1020 1.0881 1.0910 1.0882 1.0924 1.0856 1.0689 1.0672 1.0756 1.0658 1.0670
irintensity: 2.3215 3.9479 2.6067 3.7365 1.6108 0.2660 4.5106 0.9811 7.7865 1.3102 2.9069 6.0617 174.9015 0.8268 21.2111 12.1849 2.9456 6.3583 20.1400 5.7667 91.1654 84.4409 134.6591 66.0317 20.4575 6.5782 8.4367 14.4109 11.6113 20.0081 22.9863 5.3743 140.2958 51.6578 41.0693 28.8308 55.1790 9.9023 13.6924 13.2460 60.4491 14.0451 13.7888 25.5612 26.7674 86.4370 154.6453 5.2912 36.5091 29.3548 80.6929 52.3752 62.6895 37.7455 16.5388 0.1729 66.2741 39.8574 1.6478 62.2543 22.4338 3.1776 27.3199 29.1877 11.9398 34.6957 23.0603 1.1145 88.4857 59.8851 1.0230 7.7785 0.6755 52.1605 5.3820 18.8712 22.2272 2.4672 15.6847 266.9226 97.0602 65.2490 436.9146 29.4249 18.0837 10.4758 27.9404 22.5510 3.5039 19.2105 595.8302 171.1790 104.6433 41.3803 16.6702 31.5820
temp: 298.150 k
press: 1.00000 atm
elementType: 8 8 8 8 8 8 7 7 7 7 7 6 6 6 6 6 6 6 6 6 6 1 1 1 1 1 1 1 1 1 1 1 1 1
symmnumber: 1
zpe: 658550.6 jmol-1
zpe.correction: 0.250829 hartree
zpe.thermalcorrener: 0.269427 hartree
zpe.thermalcorrenthalpy: 0.270371 hartree
zpe.thermalcorrgfe: 0.205388 hartree
zpe.sumelectzpe: -1112.284379 hartree
zpe.sumelectthermal: -1112.265781 hartree
zpe.sumelectthermalent: -1112.264837 hartree
zpe.sumelectthermalfe: -1112.329819 hartree
dipole: -11.0587 -5.7763 -0.5439
dipole: 12.4883
quadrupole: -160.5837 -116.4019 -125.6766
quadrupole: 1.8605 -2.3787 -17.1902
quadrupole: -26.3630 17.8189 8.5441 1.8605 -2.3787 -17.1902
hfenergy: -1112.5352073 hartree
pointgroup: C01 [X(C10H13N5O6)]
dipole: -4.7063836 -0.802565 1.1601639 debye
polarizability: 196.4956945|27.9426953|161.193047|-1.0853455|35.279624|140.760408 unknown
InChI: InChI=1S/C10H13N5O6/c16-1-3-5(17)6(18)9(21-3)15-7-4(13-10(15)14-20)8(19)12-2-11-7/h2-3,5-6,9,11,14,16-18,20H,1H2
charge 0 multiplicity 1
34 atoms
O  -1.97975 -1.608383 -0.569975
O  -2.6090 -2.02896 2.267358
O  -2.415621 1.431518 1.191179
O  -2.081251 0.110309 -2.879009
O  -0.183733 -2.094137 -2.598437
O  4.240543 1.701762 0.19726
N  0.175378 -0.65083 0.123605
N  2.292545 -0.494506 -0.789556
N  0.302151 1.444699 1.530074
N  0.845882 -2.344061 -1.507031
N  2.466835 2.542419 1.513196
C  -0.995686 -1.454974 0.522525
C  -1.893822 -0.911538 1.658705
C  -2.884712 0.056352 0.93488
C  -2.841292 -0.374144 -0.573058
C  -2.275429 0.681256 -1.558684
C  0.799996 0.475953 0.679507
C  1.145911 -1.18213 -0.787158
C  2.108509 0.533874 0.152847
C  3.0481 1.587877 0.576698
C  1.21375 2.450793 1.898437
H  -0.643445 -2.478033 0.733344
H  -1.366213 -0.426422 2.492397
H  -3.888501 -0.073208 1.376083
H  -3.817499 -0.72938 -0.941817
H  -1.3490 1.137451 -1.162013
H  -3.025522 1.4834 -1.6918
H  -2.992018 -2.596962 1.546963
H  -3.068983 2.106601 0.889571
H  -0.722009 1.570841 1.656862
H  -1.256831 -0.457837 -2.884429
H  1.673263 -2.697651 -2.008601
H  0.799405 3.209635 2.57394
H  -1.015652 -2.448381 -2.170264
