program: Gaussian 09
title: 000266937
version: EM64L-G09RevD.01
frameworkgroup: C1[X(C12H15N3O4S)]
method: RPBEPBE
basis: SDD
operation: Freq
keyword: #p
keyword: freq=noraman
keyword: PBEPBE/SDD
title: #p freq=noraman PBEPBE/SDD
converged: NO YES NO NO
title: Mulliken charges:
elementType: S O O O O N N N C C C C C C C C C C C C H H H H H H H H H H H H H H H
charge: 0.225639 -0.242026 -0.472453 -0.463486 -0.454602 -0.165791 -0.053997 -0.005262 -0.130275 -0.160384 -0.170538 -0.109302 -0.330206 0.118850 -0.173616 0.333590 -0.403658 -0.395009 -0.386996 -0.819132 0.285976 0.266203 0.294720 0.258273 0.219879 0.206608 0.318837 0.367008 0.353555 0.262853 0.372479 0.245022 0.282066 0.241296 0.283881
chargesum: 0.00000
title: Mulliken charges with hydrogens summed into heavy atoms:
elementType: S O O O O N N N C C C C C C C C C C C C
charge: 0.225639 -0.242026 -0.105445 -0.109931 -0.082123 -0.165791 -0.053997 -0.005262 0.155701 0.105819 0.124182 0.148971 0.096281 0.118850 0.145220 0.333590 -0.140805 -0.395009 -0.141974 -0.011889
polarizability: 2.76943299e+02 -4.11002273e+00 1.75915597e+02 -2.41482757e+00 2.83614396e+00 1.06492862e+02
1716.lowfreq: -12.0668 -4.9193 -0.0019 -0.0019 -0.0016 6.0907 18.0956 37.5506 49.6259
frequency: 17.2336 37.4971 49.4569 65.1960 79.0586 99.1217 111.5140 130.0999 138.9846 171.0306 182.4680 205.5623 218.5424 244.5936 250.9125 281.8038 302.5840 317.0723 326.3024 348.2083 371.0951 400.8009 416.3263 479.5846 533.8795 541.1516 557.2603 593.4458 610.6072 618.9761 637.4798 646.3001 661.9161 688.2494 752.8039 767.5974 779.8674 795.3617 804.9832 824.9646 868.6825 894.6785 907.5207 912.1914 927.8100 944.5762 973.8660 979.1968 984.6208 992.1487 1011.3584 1032.7237 1045.0727 1052.1136 1087.8601 1118.3202 1134.2030 1156.1281 1176.2201 1191.9652 1207.7816 1221.2477 1237.1901 1252.3304 1275.4844 1282.5548 1296.1897 1299.7940 1309.3716 1332.4448 1344.1379 1349.6193 1351.9699 1386.2335 1393.1695 1404.2389 1406.8156 1427.9085 1433.2984 1450.5190 1461.2979 1486.5678 1522.3186 1545.7010 2977.6065 3026.4554 3027.1749 3028.5923 3030.9785 3034.7499 3059.6009 3152.2924 3159.6045 3169.7639 3218.2557 3240.3636 3410.9596 3569.8828 3576.8259
redmass: 5.1599 6.2028 5.4289 4.4780 4.1862 1.1254 5.2773 4.9637 5.2436 6.6283 4.3197 4.5862 6.1099 4.5447 4.6758 4.4717 3.4018 2.8588 1.5193 1.3826 3.3386 9.7541 3.7751 6.0280 5.5135 4.9987 1.1470 7.7015 4.3490 5.3870 6.4210 7.6221 7.5478 5.9606 1.6762 5.2373 6.7904 3.8140 3.4362 8.2859 3.4029 1.3245 6.4657 1.4253 4.0043 2.9935 4.2259 1.1779 2.4668 1.2963 4.6791 3.4321 1.9252 2.8031 1.7481 5.0855 2.0379 1.3445 1.1069 3.4519 1.0808 1.8106 1.6370 1.3682 1.4354 1.6347 5.2742 1.4941 1.7104 1.3774 1.1420 2.0873 1.6672 2.0729 1.8307 1.2198 2.2555 1.8149 1.0526 1.0556 1.0752 4.8723 6.4042 9.2007 1.0644 1.0856 1.0283 1.0849 1.0870 1.0902 1.0980 1.1042 1.1056 1.0922 1.0919 1.1068 1.0676 1.0665 1.0665
irintensity: 0.8079 0.6583 0.1668 4.9374 4.4801 0.2981 3.4821 0.4111 7.4938 4.6643 11.8272 2.5051 3.0959 2.9058 1.7352 1.2311 34.5896 20.8341 161.0508 103.7052 12.1797 1.9054 0.4670 12.8289 20.0987 2.2903 233.9073 3.3050 7.9381 4.1430 4.4710 4.1796 2.0291 10.6909 49.9278 88.7151 48.7399 32.5747 14.2391 16.8946 12.3521 3.1481 57.2532 11.2881 26.1624 98.7130 96.9252 6.6704 59.0269 3.2598 17.0864 176.1965 27.0040 63.7502 14.3460 2.2964 16.2268 73.7606 15.5175 114.0907 9.6719 145.8100 52.1757 5.0193 27.6021 3.6205 31.3936 4.4060 12.2821 41.0948 2.8327 73.9994 14.3283 29.1408 21.2554 65.7633 39.2474 48.9104 14.2253 29.8781 6.4452 136.3617 98.7223 70.4782 53.6168 25.4730 23.6635 5.7851 17.4989 15.4178 45.4643 8.2268 9.6136 16.2032 23.0034 15.8383 130.0785 14.9172 12.3610
temp: 298.150 k
press: 1.00000 atm
elementType: 16 8 8 8 8 7 7 7 6 6 6 6 6 6 6 6 6 6 6 6 1 1 1 1 1 1 1 1 1 1 1 1 1 1 1
symmnumber: 1
zpe: 698693.6 jmol-1
zpe.correction: 0.266118 hartree
zpe.thermalcorrener: 0.285391 hartree
zpe.thermalcorrenthalpy: 0.286335 hartree
zpe.thermalcorrgfe: 0.217040 hartree
zpe.sumelectzpe: -1327.954693 hartree
zpe.sumelectthermal: -1327.935420 hartree
zpe.sumelectthermalent: -1327.934476 hartree
zpe.sumelectthermalfe: -1328.003771 hartree
dipole: -0.7167 -1.4171 3.2775
dipole: 3.6420
quadrupole: -134.0962 -119.7775 -120.7022
quadrupole: -9.0673 6.8201 1.1736
quadrupole: -9.2376 5.0811 4.1564 -9.0673 6.8201 1.1736
hfenergy: -1328.2208112 hartree
pointgroup: C01 [X(C12H15N3O4S1)]
dipole: 0.1907638 -1.044174 -0.9624957 debye
polarizability: 276.5537805|-6.9886506|163.2428785|-6.6424178|-26.8008778|119.5550995 unknown
InChI: InChI=1S/C12H15N3O4S/c1-20-11-6-2-3-15(10(6)13-5-14-11)12-9(18)8(17)7(4-16)19-12/h2-3,5,7-9,12,16-18H,4H2,1H3
charge 0 multiplicity 1
35 atoms
S  4.835115 -1.463679 0.472223
O  -2.082625 0.783659 0.992103
O  -3.122168 0.914076 -1.877802
O  -2.910591 -2.254605 0.003683
O  -5.128538 1.348438 0.068964
N  -0.094837 -0.248978 0.00992
N  1.45509 1.470278 -0.81158
N  3.813523 0.870636 -0.574856
C  -1.319273 0.529434 -0.226422
C  -2.331292 -0.131033 -1.201753
C  -3.339273 -0.880063 -0.285747
C  -3.303717 -0.091268 1.045188
C  -4.529821 0.808433 1.286562
C  1.1803 0.264629 -0.241183
C  0.052604 -1.521227 0.60148
C  2.14452 -0.708335 0.190469
C  1.406783 -1.829449 0.722141
C  3.50181 -0.33004 -0.015181
C  2.788797 1.707559 -0.941556
C  6.342488 -0.452634 -0.018331
H  -0.957624 1.504259 -0.603558
H  -1.839407 -0.792172 -1.939482
H  -4.34328 -0.852467 -0.748406
H  -3.169466 -0.794989 1.887186
H  -4.216368 1.618852 1.976444
H  -5.328996 0.219993 1.771623
H  -0.830125 -2.099847 0.866342
H  -2.531375 1.47982 -2.436058
H  -3.115181 -2.838477 -0.768757
H  1.812668 -2.748142 1.140655
H  -4.417984 1.570719 -0.597131
H  3.08094 2.662157 -1.387508
H  6.3165 -0.250219 -1.09763
H  7.210883 -1.074398 0.249407
H  6.347018 0.495482 0.536253
