program: Gaussian 09
title: 000266934
version: EM64L-G09RevD.01
frameworkgroup: C1[X(C9H14N4O5)]
method: RPBEPBE
basis: SDD
operation: Freq
keyword: #p
keyword: freq=noraman
keyword: PBEPBE/SDD
title: #p freq=noraman PBEPBE/SDD
converged: NO YES NO NO
title: Mulliken charges:
elementType: O O O O O N N N N C C C C C C C C C H H H H H H H H H H H H H H
charge: -0.252603 -0.442016 -0.471641 -0.498772 -0.338864 -0.179803 -0.104099 -0.640812 -0.623255 -0.163363 -0.151173 -0.168542 -0.035725 -0.397468 0.310279 -0.268351 -0.107168 0.190204 0.264251 0.302552 0.239512 0.252158 0.257233 0.234636 0.348994 0.386318 0.310502 0.376571 0.334180 0.370495 0.342796 0.322975
chargesum: 0.00000
title: Mulliken charges with hydrogens summed into heavy atoms:
elementType: O O O O O N N N N C C C C C C C C C
charge: -0.252603 -0.093022 -0.085323 -0.122202 -0.338864 -0.179803 -0.104099 0.063863 0.042516 0.100889 0.151379 0.070971 0.216433 0.094401 0.310279 0.042151 -0.107168 0.190204
polarizability: 1.81015630e+02 1.21478375e+01 1.23916968e+02 4.26836238e+00 -1.68791745e+01 1.17783827e+02
1716.lowfreq: -13.5923 -8.1480 -0.0008 -0.0006 0.0002 6.5399 20.5799 35.9675 68.8125
frequency: 20.1675 35.8406 68.7799 86.5744 110.1502 120.8840 158.2380 178.6839 186.2712 204.0454 231.4279 270.3315 275.4911 289.9121 307.2064 321.0506 332.9949 367.9902 389.4151 404.9364 430.7842 433.0145 467.9340 514.3010 549.3295 554.0953 617.8811 637.1660 651.9072 665.9111 707.2427 712.7813 722.3910 730.9759 743.5330 763.6403 776.6178 802.6930 805.5420 866.1491 927.7080 947.5775 952.1297 973.3849 985.7987 1010.0452 1029.5355 1049.9395 1076.9229 1088.7838 1137.0432 1146.5551 1171.9993 1179.5515 1194.2990 1200.5364 1226.9014 1246.3180 1270.3430 1273.6874 1283.9428 1298.8707 1309.8513 1335.0154 1347.1516 1376.8472 1403.4694 1412.9454 1423.0773 1442.3773 1471.5876 1477.6969 1550.5490 1579.3003 1616.6923 1643.5168 2983.2919 3001.4685 3032.9645 3054.7467 3065.3048 3078.3567 3242.0528 3329.9165 3411.1999 3513.2595 3570.9951 3602.6995 3622.3134 3682.3833
redmass: 6.1558 4.9153 5.5733 5.3902 6.1141 6.3127 3.9772 4.5722 5.7108 5.0180 5.3705 1.9266 4.6285 2.5649 2.8980 3.0242 1.4360 2.4868 2.3493 2.4405 2.9963 6.2844 6.6398 1.2227 5.3396 3.7231 1.1701 3.1245 5.3869 5.6538 1.3866 1.6724 1.8988 4.3508 4.6707 1.9208 2.4418 5.7341 3.3338 4.9721 3.4503 3.8499 5.1326 3.3224 2.3319 5.1348 2.9224 1.9258 2.4710 2.2699 2.1580 2.1375 1.2729 1.2201 2.1800 1.4955 1.2780 3.1582 1.2583 1.2989 1.9918 1.3211 1.3394 1.3832 1.3484 1.3442 1.5703 4.2852 1.4451 3.9835 1.0835 4.1730 2.4708 1.3548 2.0828 4.2972 1.0859 1.0562 1.0862 1.0922 1.0878 1.1048 1.0995 1.0661 1.0531 1.0448 1.0664 1.0670 1.0958 1.1043
irintensity: 0.5979 2.5775 7.6886 1.0956 0.6436 9.6371 7.7813 17.5801 8.9507 5.9634 29.5960 80.2801 4.9117 32.5411 44.6110 27.6149 125.7202 20.5492 46.6965 36.2769 64.0051 9.5971 11.5103 186.3590 3.7761 3.3543 68.9725 1.7054 20.2766 22.2254 138.1597 45.5780 164.9956 12.4984 19.1259 126.4183 10.8792 74.8888 44.5239 36.1324 82.7937 5.4807 60.8915 38.4748 17.8497 146.8963 37.7286 6.6207 1.5727 20.8275 9.8655 3.7449 57.3886 28.6863 5.0920 39.5804 14.2854 154.3627 10.8826 41.1919 12.5243 2.7410 13.3439 1.3338 15.9124 30.7948 15.1584 15.8831 46.5679 1.9048 6.2306 108.2030 314.1399 206.2177 96.3609 419.0764 54.1256 21.6225 19.0802 11.8947 9.6959 47.2006 16.1338 196.7324 99.4162 50.8486 13.0249 14.1735 61.5661 52.5275
temp: 298.150 k
press: 1.00000 atm
elementType: 8 8 8 8 8 7 7 7 7 6 6 6 6 6 6 6 6 6 1 1 1 1 1 1 1 1 1 1 1 1 1 1
symmnumber: 1
zpe: 650572.2 jmol-1
zpe.correction: 0.247790 hartree
zpe.thermalcorrener: 0.265233 hartree
zpe.thermalcorrenthalpy: 0.266177 hartree
zpe.thermalcorrgfe: 0.202173 hartree
zpe.sumelectzpe: -945.095318 hartree
zpe.sumelectthermal: -945.077875 hartree
zpe.sumelectthermalent: -945.076930 hartree
zpe.sumelectthermalfe: -945.140935 hartree
dipole: -5.3406 2.5300 0.5746
dipole: 5.9374
quadrupole: -105.6796 -96.2840 -103.6738
quadrupole: 3.9852 -5.1826 7.2413
quadrupole: -3.8004 5.5951 -1.7946 3.9852 -5.1826 7.2413
hfenergy: -945.3431077 hartree
pointgroup: C01 [X(C9H14N4O5)]
dipole: 2.242184 -0.6525326 0.0595684 debye
polarizability: 174.1604164|21.0327145|130.5957252|-13.1666346|13.4777726|117.9602828 unknown
InChI: InChI=1S/C9H14N4O5/c10-7-4(8(11)17)12-2-13(7)9-6(16)5(15)3(1-14)18-9/h2-3,5-6,9,14-16H,1,10-11H2
charge 0 multiplicity 1
32 atoms
O  1.573762 1.107547 1.1117
O  2.370019 2.864718 -1.223763
O  2.760804 -0.753605 -1.584862
O  3.617193 -1.973466 0.628643
O  -4.115543 -0.21409 1.368237
N  -0.271344 0.489276 -0.354042
N  -1.603487 -1.151737 -1.202735
N  -1.703658 1.355573 1.456082
N  -4.228952 -1.887911 -0.273721
C  1.879083 1.485013 -1.237765
C  0.820979 1.435071 -0.119246
C  2.967334 0.463052 -0.802696
C  2.750384 0.277436 0.739889
C  2.47284 -1.180365 1.149058
C  -1.443644 0.492187 0.418459
C  -0.416108 -0.550227 -1.316559
C  -2.263422 -0.513951 -0.126216
C  -3.593054 -0.8507 0.378241
H  1.481546 1.204494 -2.230594
H  0.393783 2.436728 0.056881
H  3.979544 0.872606 -0.993624
H  3.602271 0.677754 1.314264
H  1.524662 -1.531476 0.700774
H  2.417289 -1.252675 2.250242
H  3.051007 2.974309 -1.934338
H  3.236656 -1.494225 -1.102167
H  0.384895 -0.818503 -2.000119
H  3.60918 -2.884145 1.011617
H  -0.947904 1.760387 2.006473
H  -2.631469 1.209868 1.876008
H  -3.75517 -2.341707 -1.055703
H  -5.161775 -2.169437 0.018381
