program: Gaussian 09
title: 000266933
version: EM64L-G09RevD.01
frameworkgroup: C1[X(C10H16N6O6)]
method: RPBEPBE
basis: SDD
operation: Freq
keyword: #p
keyword: freq=noraman
keyword: PBEPBE/SDD
title: #p freq=noraman PBEPBE/SDD
converged: YES YES NO NO
title: Mulliken charges:
elementType: O O O O O O N N N N N N C C C C C C C C C C H H H H H H H H H H H H H H H H
charge: -0.302708 -0.508503 -0.473749 -0.445664 -0.431063 -0.348950 -0.219207 -0.124480 -0.360780 -0.360285 -0.486384 -0.501559 -0.139243 -0.059641 -0.157967 -0.039600 -0.344055 0.198951 -0.225618 -0.050500 0.249633 0.213070 0.247499 0.285125 0.249830 0.238427 0.228940 0.183027 0.401288 0.393561 0.303790 0.371591 0.397548 0.372115 0.325462 0.301569 0.307857 0.310673
chargesum: 0.00000
title: Mulliken charges with hydrogens summed into heavy atoms:
elementType: O O O O O O N N N N N N C C C C C C C C C C
charge: -0.302708 -0.107215 -0.080188 -0.074073 -0.431063 -0.348950 -0.219207 -0.124480 0.036767 0.011830 0.140646 0.116971 0.108257 0.225484 0.091863 0.198827 0.067912 0.198951 0.078172 -0.050500 0.249633 0.213070
polarizability: 2.53417439e+02 -3.82027102e+00 2.08128392e+02 -5.19007578e+00 -5.43028091e+00 9.76291738e+01
1716.lowfreq: -20.2835 -0.0010 -0.0007 0.0007 2.0664 5.6507 9.4428 30.0596 41.6829
frequency: -17.9362 29.9009 41.6611 54.9778 73.9086 85.7864 100.1837 105.4676 133.9156 145.4837 157.6097 169.2603 191.4512 203.3455 223.3010 242.2412 266.4377 290.8482 294.4843 309.5635 323.6494 338.8307 345.6789 352.6423 374.9854 396.1257 415.7030 451.9954 467.8373 507.9136 558.3848 570.1190 594.5779 613.5934 637.1390 644.9878 691.3683 700.5973 725.4552 730.3347 749.4595 765.1317 776.9209 802.0515 828.8925 833.4105 846.1545 864.1300 931.1648 962.0827 970.2169 977.3772 992.8654 1001.4016 1023.9297 1039.8417 1055.9167 1066.6128 1090.7753 1132.2909 1139.6981 1157.0339 1160.4627 1191.4004 1209.3057 1235.0494 1239.1132 1259.5883 1265.1558 1272.1149 1278.2884 1280.8922 1286.7443 1288.4463 1301.4743 1326.8111 1340.3853 1359.7008 1362.2456 1375.6489 1389.0660 1400.8111 1407.2059 1443.5969 1463.4746 1486.2769 1500.5702 1538.3524 1557.3106 1618.8836 1656.6458 1673.9155 2744.0177 2953.6293 2987.5243 3002.9511 3029.9105 3044.9407 3079.6147 3215.5318 3279.3314 3397.6080 3409.1933 3413.2473 3447.1889 3500.9142 3519.1996 3571.3204
redmass: 1.4175 5.5921 5.0461 6.8166 5.7281 6.9533 4.9538 7.1503 5.4647 3.4874 4.7490 4.4130 4.5842 3.5807 5.2044 4.4337 1.6611 4.4913 4.9814 5.5365 4.2542 7.0144 5.3489 5.0702 4.0398 5.2519 5.0192 2.5813 1.3714 7.4840 4.4872 1.2885 7.1358 6.8560 5.5959 6.1148 6.8852 3.8711 1.5144 1.1140 1.6243 7.3600 1.1257 4.7538 2.4604 4.6780 1.4098 7.1749 2.8597 4.8341 5.8207 5.6412 5.6658 4.3512 1.0843 3.5342 4.3154 4.0562 2.4126 4.5570 2.4572 2.1595 1.3110 2.4528 1.2585 2.6239 1.4099 1.7942 1.2444 1.8794 1.2465 1.1730 1.2683 1.7755 1.7200 1.3205 2.6062 1.9294 1.4435 2.8209 1.4072 1.5193 1.3204 3.6462 3.4615 1.0954 3.4877 4.7771 4.2852 1.3537 1.4296 1.0641 1.1168 1.0699 1.0832 1.0868 1.0857 1.0876 1.0955 1.0655 1.0994 1.0430 1.0644 1.0434 1.0675 1.0798 1.0989 1.1004
irintensity: 40.4398 0.7616 1.9561 4.3328 2.5670 4.1634 16.2317 7.2393 1.4945 8.6137 1.7443 2.8027 4.4343 17.0151 13.5791 20.8446 60.3933 27.0710 8.4786 8.2029 4.4491 22.8061 32.8855 4.2873 44.1715 7.2540 2.2657 66.0515 89.7177 2.7503 32.9778 114.4093 4.7619 21.4171 11.8436 29.0575 27.0195 4.7717 364.5857 133.4272 167.2827 13.8566 179.0003 13.2612 3.3004 32.5115 19.3196 69.5955 7.5907 15.2356 118.0815 32.6482 110.0879 4.9271 163.1297 25.9079 7.3708 171.1015 19.5390 28.4727 14.8916 5.3011 84.2687 27.8253 8.5598 9.0600 8.1991 62.2325 24.3399 34.9466 4.5645 6.0060 42.5513 13.5873 29.6977 31.8037 5.9360 45.6755 52.3683 47.0566 7.5773 245.5406 162.8369 22.7656 31.2284 4.7979 528.0789 148.6728 1.7999 33.7739 15.3066 32.3611 812.5123 45.7526 36.2565 21.1757 7.3243 44.6535 33.8646 601.5728 6.5567 1.6574 64.6195 34.3968 36.2127 75.0757 5.5967 25.2783
temp: 298.150 k
press: 1.00000 atm
elementType: 8 8 8 8 8 8 7 7 7 7 7 7 6 6 6 6 6 6 6 6 6 6 1 1 1 1 1 1 1 1 1 1 1 1 1 1 1 1
symmnumber: 1
zpe: 761627.4 jmol-1
zpe.correction: 0.290089 hartree
zpe.thermalcorrener: 0.310836 hartree
zpe.thermalcorrenthalpy: 0.311780 hartree
zpe.thermalcorrgfe: 0.240462 hartree
zpe.sumelectzpe: -1168.788256 hartree
zpe.sumelectthermal: -1168.767508 hartree
zpe.sumelectthermalent: -1168.766564 hartree
zpe.sumelectthermalfe: -1168.837882 hartree
dipole: -5.6193 1.0838 -0.6941
dipole: 5.7648
quadrupole: -148.3403 -126.9469 -128.1935
quadrupole: -2.7223 1.4506 -9.3712
quadrupole: -13.8467 7.5467 6.3001 -2.7223 1.4506 -9.3712
hfenergy: -1169.0783442 hartree
pointgroup: C01 [X(C10H16N6O6)]
dipole: -2.1890546 0.5787986 -0.1305784 debye
polarizability: 252.0070717|-5.7815253|208.7898425|-12.6288068|4.8209664|98.3780911 unknown
InChI: InChI=1S/C10H16N6O6/c11-14-8(20)4-5(9(21)15-12)16(2-13-4)10-7(19)6(18)3(1-17)22-10/h2-3,6-7,10,14-15,17-19H,1,11-12H2
charge 0 multiplicity 1
38 atoms
O  2.206133 -1.142558 -0.92993
O  2.482321 1.938433 0.666118
O  4.579344 0.550898 1.319565
O  5.907915 -1.548317 -0.373476
O  -0.0194 2.422207 0.005012
O  -4.210154 0.545206 0.495817
N  0.038052 -0.52817 -0.210039
N  -1.621101 -2.038208 0.05977
N  -2.320754 2.322675 0.168234
N  -4.264015 -1.776911 0.603963
N  -2.353634 3.716731 0.360215
N  -5.665459 -1.862311 0.791018
C  2.115048 0.546706 0.838394
C  1.400503 -0.011592 -0.445637
C  3.44617 -0.255056 0.897179
C  3.601974 -0.788582 -0.551574
C  4.539692 -1.99073 -0.662629
C  -1.128249 0.229542 0.014066
C  -0.308203 -1.875444 -0.172376
C  -2.150792 -0.743495 0.175405
C  -1.110634 1.710046 0.054111
C  -3.595991 -0.589425 0.439326
H  1.483484 0.402624 1.735415
H  1.35542 0.787156 -1.208704
H  3.365353 -1.102126 1.60103
H  3.968501 0.032292 -1.203441
H  4.556443 -2.396875 -1.687229
H  4.21401 -2.791236 0.036221
H  1.616729 2.415316 0.452003
H  4.327002 1.500411 1.127844
H  0.420663 -2.659708 -0.342814
H  5.882356 -0.869245 0.35712
H  -3.211476 1.748808 0.316225
H  -3.738317 -2.650439 0.492422
H  -1.402846 4.101067 0.267104
H  -3.069508 4.172276 -0.21464
H  -5.925136 -1.608656 1.754745
H  -6.155643 -1.265208 0.110468
