program: Gaussian 09
title: 000266929
version: EM64L-G09RevD.01
frameworkgroup: C1[X(C8H10BrN3O6)]
method: RPBEPBE
basis: SDD
operation: Freq
keyword: #p
keyword: freq=noraman
keyword: PBEPBE/SDD
title: #p freq=noraman PBEPBE/SDD
converged: YES YES NO NO
title: Mulliken charges:
elementType: Br O O O O O O N N N C C C C C C C C H H H H H H H H H H
charge: 0.140435 -0.273091 -0.438257 -0.423493 -0.432237 -0.211555 -0.173352 -0.114315 -0.019793 0.072828 -0.167623 -0.162643 -0.104437 -0.118975 -0.380767 -0.210586 -0.199494 0.181037 0.293180 0.297300 0.321007 0.264318 0.223061 0.263515 0.362574 0.353837 0.309892 0.347634
chargesum: 0.00000
title: Mulliken charges with hydrogens summed into heavy atoms:
elementType: Br O O O O O O N N N C C C C C C C C
charge: 0.140435 -0.273091 -0.075683 -0.069657 -0.084603 -0.211555 -0.173352 -0.114315 -0.019793 0.072828 0.125556 0.134657 0.216570 0.145343 0.105809 -0.210586 0.110398 0.181037
polarizability: 1.87496493e+02 -4.86286037e+00 1.58960769e+02 6.92650731e+00 2.91031215e+00 8.58058830e+01
1716.lowfreq: -7.2933 0.0006 0.0007 0.0008 3.5753 8.4387 20.2927 31.6559 39.1719
frequency: 19.5443 31.6387 39.1529 45.5575 85.2232 108.3401 119.6689 131.6496 165.3766 166.7834 210.8055 234.1349 245.3786 271.5924 286.3404 301.7764 307.8415 311.5407 334.9419 362.3398 384.1425 411.6097 442.1974 504.1061 524.3916 589.3807 613.2904 637.8237 704.3514 721.5229 743.3677 744.8148 780.6928 807.9740 826.1127 885.0545 919.4156 952.0492 957.1315 977.2333 996.4154 1019.1367 1029.5039 1049.6020 1060.5888 1073.4553 1143.3872 1157.3429 1174.1101 1204.2463 1208.1459 1227.3869 1231.8827 1244.0792 1274.1959 1278.0257 1292.0141 1322.7374 1327.3464 1340.9074 1351.1764 1365.8260 1370.7286 1371.8859 1389.4340 1419.0547 1451.1248 1473.4730 3002.4928 3027.9852 3032.8032 3064.5724 3090.1231 3110.1525 3264.7043 3528.4798 3570.6876 3580.1201
redmass: 7.3475 12.4903 10.6708 8.1713 5.4658 7.7059 5.1876 11.9321 6.9048 6.4533 3.6700 7.2034 7.3678 4.8958 3.1511 1.5310 2.0978 1.4731 1.5825 3.0173 5.8854 6.7383 6.3480 9.9183 4.5174 9.1669 11.9224 4.9394 6.8043 12.4503 5.3963 10.1413 6.0976 1.3294 2.4266 3.6042 3.6319 4.9097 3.7210 4.3896 3.2191 4.0412 5.6984 2.8744 3.1834 1.6372 1.2903 1.6114 1.5648 3.9168 1.6569 1.4082 2.2833 1.5229 7.6540 1.2873 1.3586 1.6322 2.4116 1.7291 1.3611 1.3340 1.2304 12.4460 1.3533 4.7970 10.0512 1.0746 1.0660 1.0860 1.0878 1.0874 1.0879 1.1006 1.0985 1.0668 1.0667 1.0666
irintensity: 1.9451 0.0666 0.8902 1.9772 2.5630 3.2180 5.2102 0.6274 1.1015 3.8074 4.0282 4.8025 4.8080 4.4561 7.4953 17.3102 179.8250 164.6070 89.7065 12.7182 2.1645 3.7590 10.6717 0.3621 20.8278 2.1450 4.7316 8.6440 8.8009 1.5729 61.1646 9.9891 68.3814 31.5164 20.4490 23.9045 26.4088 30.2063 47.8463 104.9400 93.7635 17.0053 145.9500 25.2427 43.1101 29.3913 7.8349 31.1175 25.0925 241.2909 42.4658 25.9757 7.3844 2.7448 37.5213 2.7663 8.6283 32.6798 17.3977 15.4104 7.1582 11.8730 9.5784 92.9508 11.8023 19.3931 139.3718 9.7833 40.7720 24.6139 15.6436 4.3455 3.4260 7.9780 3.5353 20.7462 12.3286 21.4977
temp: 298.150 k
press: 1.00000 atm
elementType: 35 8 8 8 8 8 8 7 7 7 6 6 6 6 6 6 6 6 1 1 1 1 1 1 1 1 1 1
symmnumber: 1
zpe: 508566.2 jmol-1
zpe.correction: 0.193703 hartree
zpe.thermalcorrener: 0.211609 hartree
zpe.thermalcorrenthalpy: 0.212553 hartree
zpe.thermalcorrgfe: 0.145088 hartree
zpe.sumelectzpe: -938.380594 hartree
zpe.sumelectthermal: -938.362688 hartree
zpe.sumelectthermalent: -938.361744 hartree
zpe.sumelectthermalfe: -938.429209 hartree
dipole: -7.8703 2.0199 -0.6216
dipole: 8.1491
quadrupole: -137.3771 -113.7229 -115.8212
quadrupole: 17.7082 0.1315 5.9886
quadrupole: -15.0700 8.5842 6.4858 17.7082 0.1315 5.9886
hfenergy: -938.5742966 hartree
pointgroup: C01 [X(C8H10Br1N3O6)]
dipole: 3.0862836 0.2217657 0.8395026 debye
polarizability: 184.9731282|-6.2867868|143.1357385|17.7414939|29.0406446|104.1542782 unknown
InChI: InChI=1S/C8H10BrN3O6/c9-6-7(12(16)17)10-2-11(6)8-5(15)4(14)3(1-13)18-8/h2-5,8,13-15H,1H2
charge 0 multiplicity 1
28 atoms
Br -1.835815 2.213017 0.986734
O  1.625078 -1.022916 0.926769
O  2.198886 2.064564 1.070951
O  1.976682 0.080259 -2.115968
O  5.280249 -0.385762 0.224801
O  -4.445748 1.133659 -0.48439
O  -4.64113 -0.864905 -1.584293
N  -0.511527 -0.249397 0.230076
N  -2.010954 -1.518073 -0.911625
N  -3.979107 -0.004789 -0.896287
C  1.530724 1.239081 0.062687
C  2.533802 0.418996 -0.803424
C  0.775646 0.154936 0.87806
C  2.847964 -0.808973 0.074695
C  4.060184 -0.614521 1.009384
C  -1.695406 0.493998 0.171351
C  -0.757034 -1.461002 -0.431457
C  -2.599715 -0.313212 -0.545503
H  0.857726 1.836017 -0.580343
H  3.451953 0.981348 -1.033749
H  0.563712 0.512666 1.899434
H  2.967451 -1.716219 -0.54662
H  4.152331 -1.489361 1.682032
H  3.924039 0.293606 1.615907
H  2.699817 2.79381 0.626884
H  1.152492 -0.464537 -2.019031
H  -0.023085 -2.259758 -0.468228
H  5.584085 -1.235929 -0.181748
