program: Gaussian 09
title: 000266927
version: EM64L-G09RevD.01
frameworkgroup: C1[X(C23H30O4)]
method: RPBEPBE
basis: SDD
operation: Freq
keyword: #pfreq=noraman
keyword: PBEPBE/SDD
title: #p freq=noraman PBEPBE/SDD
converged: YES YES NO NO
title: Mulliken charges:
elementType: O O O O C C C C C C C C C C C C C C C C C C C C C C C H H H H H H H H H H H H H H H H H H H H H H H H H H H H H H
charge: -0.279068 -0.227102 -0.267680 -0.226860 -0.151834 0.179720 0.250986 -0.480879 -0.555110 -0.458119 0.454045 -0.452277 -0.536415 -0.794142 0.101737 -0.786749 0.128195 -0.645097 -0.007251 0.238909 0.091549 0.028117 -0.534455 -0.502193 -0.412994 -0.506334 -0.534138 0.245494 0.220481 0.202823 0.221777 0.226396 0.224259 0.200543 0.238901 0.198038 0.248353 0.239829 0.230803 0.212454 0.252762 0.226192 0.241937 0.225573 0.241904 0.262202 0.222984 0.230612 0.248888 0.213612 0.210276 0.238030 0.232186 0.242861 0.219868 0.220434 0.244966
chargesum: 0.00000
title: Mulliken charges with hydrogens summed into heavy atoms:
elementType: O O O O C C C C C C C C C C C C C C C C C C C C C C C
charge: -0.279068 -0.227102 -0.267680 -0.226860 0.093661 0.179720 0.250986 -0.057575 -0.106937 -0.033318 0.454045 -0.015337 -0.048233 -0.098122 0.101737 -0.093047 0.128195 -0.403193 -0.007251 0.238909 0.091549 0.028117 -0.049270 -0.022693 0.010894 0.206743 0.151131
polarizability: 3.19035806e+02 -2.54642263e+00 2.70227562e+02 8.01084904e+00 -1.55241182e-01 1.89615272e+02
1716.lowfreq: -19.5303 -9.5184 -0.0006 0.0001 0.0004 4.2014 30.1253 35.1926 57.2669
frequency: 30.0472 34.7252 57.2544 66.5103 73.7303 81.6721 98.5020 108.4348 115.2623 134.4867 145.9061 166.8579 174.3693 188.1712 207.0776 209.6752 224.4660 242.1634 247.8885 257.7388 264.6844 288.2553 294.7766 298.0841 308.3591 312.2033 335.4813 347.2863 353.5444 369.6487 394.5565 404.0894 414.7316 439.4561 446.9915 460.8594 463.2494 495.5390 502.9976 514.9600 533.7994 546.1591 619.6994 634.1808 643.3526 649.8874 669.3898 687.4823 706.6285 726.4115 754.5903 778.5657 805.5926 822.1150 834.5390 849.8272 857.6742 861.1722 882.0422 892.4985 910.5399 918.3191 924.1359 944.1374 956.5432 970.3802 978.1765 991.9869 1002.2020 1030.0455 1046.8042 1048.1962 1055.8958 1061.7897 1071.7379 1086.2345 1096.7173 1107.6173 1112.9455 1113.0098 1122.5397 1129.0034 1134.9926 1147.1328 1150.2126 1162.0024 1169.4272 1184.2751 1193.5228 1205.0952 1219.6192 1227.9340 1232.8640 1245.0400 1245.9640 1256.2216 1282.0793 1290.4853 1305.0666 1311.8726 1319.9037 1329.8668 1335.3812 1336.3572 1342.8652 1347.4129 1348.2991 1356.5391 1372.5450 1385.3788 1393.7902 1398.0829 1420.7112 1428.2278 1435.1553 1439.7628 1452.4331 1453.7777 1454.9760 1458.6508 1463.5436 1464.7829 1467.2730 1468.5096 1472.5982 1473.4799 1478.8176 1481.8821 1485.8303 1489.3581 1501.2949 1562.5159 1576.1278 1592.3147 1614.9734 2955.8760 2957.3925 2965.7791 2974.0355 2977.9064 2981.3901 2984.7898 2987.4615 2989.6533 2993.0568 2994.4456 2996.7412 3000.8051 3027.0402 3042.5867 3043.8513 3049.2029 3054.9852 3056.2995 3057.4899 3060.3613 3060.6684 3076.1104 3084.0321 3094.2878 3098.0212 3101.1206 3121.4503 3146.0067 3157.6322
redmass: 3.9563 4.4840 5.0615 2.6680 3.8595 3.0725 3.2736 3.3157 1.3442 3.7966 3.0116 2.8863 2.5015 3.5885 1.7322 3.1629 2.6969 1.9674 1.8664 2.0429 1.8425 1.6174 2.2702 2.0600 2.2126 3.0284 3.8743 2.9435 3.6447 3.2325 3.7794 3.3765 3.6278 4.6576 3.1153 2.8733 4.0610 4.1270 3.0933 3.7754 2.9986 3.3790 2.9663 3.4519 3.4328 3.8248 2.9920 4.8435 3.5459 6.1354 3.5613 3.3834 2.5883 2.2019 3.3807 1.8554 1.9798 1.9864 1.6626 2.3858 2.5041 2.1576 2.5719 3.6514 2.6722 2.2539 1.6961 2.0547 2.1769 2.8621 2.4960 1.7896 2.2471 2.6980 2.3789 1.8113 2.3713 2.3640 1.2747 1.3276 2.3171 2.2570 1.2644 1.4622 2.0894 1.5802 1.9288 1.8925 1.9996 1.7523 1.7970 1.7937 2.9166 1.6741 1.3870 1.4430 3.9425 1.2733 1.5754 1.3510 1.4651 1.6171 1.5859 1.4318 1.6121 1.5550 1.4507 1.5749 3.6812 1.2067 1.7124 1.6817 1.1773 1.3873 1.1010 1.1759 1.0522 1.1490 1.4500 1.0766 1.0597 1.0801 1.0741 1.1532 1.0672 1.0874 1.2331 1.0838 1.0791 1.0605 1.0631 8.4497 7.0406 7.8343 9.3652 1.0335 1.0693 1.0670 1.0621 1.0629 1.0607 1.0455 1.0702 1.0607 1.0515 1.0622 1.0573 1.0298 1.0995 1.1037 1.0975 1.0994 1.0930 1.0916 1.0978 1.0998 1.0952 1.0980 1.0978 1.0973 1.1012 1.1041 1.0991 1.1047 1.0882
irintensity: 0.1082 1.9058 2.3024 2.0548 1.7865 0.2972 0.2292 2.7571 1.2825 4.1155 2.0781 1.3288 0.2711 2.5517 1.9462 0.1343 1.5579 2.2179 0.5884 3.0538 2.8738 2.6777 2.9042 1.8437 0.4859 6.1401 1.5102 0.5085 8.5399 0.6903 10.0669 1.1191 0.0879 2.5102 2.0533 1.8287 2.0231 3.8195 3.5018 2.7983 6.2992 12.2061 1.6077 2.8148 1.6761 0.3740 1.1203 2.2513 2.1833 11.3618 10.0264 2.9707 2.7551 26.2970 1.2220 3.0136 4.4513 5.8725 15.8387 7.3251 0.4962 5.5295 4.1282 2.5562 28.4170 19.7568 17.0268 8.9747 2.1205 34.6457 17.5999 65.1618 10.9054 15.6771 3.1965 20.8260 5.6054 109.9169 1.8088 13.6860 10.5690 21.4604 5.5867 17.4254 28.9172 25.4408 42.7818 26.0189 3.7104 11.9559 18.2901 31.4995 13.5482 9.3561 24.4094 26.2256 172.2017 2.5706 26.3306 0.3232 7.7560 6.3286 2.2654 1.3050 2.2988 4.1996 6.4019 10.1176 20.0687 14.7002 30.5235 15.0911 14.6909 24.2106 10.1125 9.2717 15.7683 2.7367 64.0622 11.6143 7.9967 1.8838 16.4027 11.0433 27.7761 22.6401 22.6078 16.2440 24.1154 7.0641 5.5563 209.1009 38.2330 1.2049 135.5537 60.2624 21.8201 10.1874 24.4622 9.9816 8.8210 43.4783 1.3668 48.2514 5.0070 70.9268 36.6778 34.4218 30.8219 42.9167 32.9840 59.0918 31.3662 13.8611 5.7412 54.0602 21.3732 31.5113 34.1676 33.4464 20.8270 28.7611 27.4315 13.7637 11.5853
temp: 298.150 k
press: 1.00000 atm
elementType: 8 8 8 8 6 6 6 6 6 6 6 6 6 6 6 6 6 6 6 6 6 6 6 6 6 6 6 1 1 1 1 1 1 1 1 1 1 1 1 1 1 1 1 1 1 1 1 1 1 1 1 1 1 1 1 1 1
symmnumber: 1
zpe: 1264853.3 jmol-1
zpe.correction: 0.481757 hartree
zpe.thermalcorrener: 0.507874 hartree
zpe.thermalcorrenthalpy: 0.508818 hartree
zpe.thermalcorrgfe: 0.427326 hartree
zpe.sumelectzpe: -1193.310584 hartree
zpe.sumelectthermal: -1193.284467 hartree
zpe.sumelectthermalent: -1193.283523 hartree
zpe.sumelectthermalfe: -1193.365015 hartree
dipole: 0.5603 3.1370 0.3671
dipole: 3.2077
quadrupole: -159.8350 -161.4736 -153.4214
quadrupole: 14.4935 -6.4576 3.0935
quadrupole: -1.5917 -3.2303 4.8220 14.4935 -6.4576 3.0935
hfenergy: -1193.7923411 hartree
pointgroup: C01 [X(C23H30O4)]
dipole: 0.2552122 -1.2198508 -0.1986862 debye
polarizability: 319.078885|4.123809|270.2439524|-5.8586566|3.5288864|189.5558029 unknown
InChI: InChI=1S/C23H30O4/c1-22-11-6-12-23(2,21(25)27-4)19(22)10-9-14-16(22)13-18(26-3)15-7-5-8-17(24)20(14)15/h13,19H,5-12H2,1-4H3
charge 0 multiplicity 1
57 atoms
O  -3.931544 0.603647 -1.830453
O  -5.016574 -0.986906 -0.538049
O  3.556648 -2.614191 -0.413459
O  2.599574 3.364225 -0.268042
C  -1.825928 0.702914 0.153611
C  -1.041527 -0.666325 0.114992
C  -3.355031 0.549832 0.533175
C  -1.321362 -1.486212 1.422719
C  -1.072512 1.697506 1.063525
C  -3.544271 -0.315397 1.809458
C  0.496421 -0.435348 0.020761
C  -2.821415 -1.67486 1.728183
C  0.282762 2.064472 0.43489
C  -1.486229 -1.488388 -1.135128
C  1.1215 0.838716 0.101249
C  -4.027162 1.944938 0.757509
C  -4.16943 -0.065339 -0.623258
C  1.309768 -1.587473 -0.153303
C  2.552577 0.932922 -0.07996
C  3.358405 -0.236334 -0.235316
C  2.707588 -1.497031 -0.262499
C  3.235306 2.267701 -0.178044
C  4.873889 -0.187985 -0.346242
C  4.767264 2.310642 -0.24084
C  5.446673 1.062741 0.343208
C  -4.722003 0.131811 -2.99073
C  2.941228 -3.941356 -0.411524
H  -1.801653 1.130898 -0.869231
H  -0.839157 -0.970331 2.277202
H  -0.827645 -2.474312 1.342705
H  -0.920393 1.273515 2.07544
H  -1.647091 2.631325 1.188378
H  -4.6243 -0.469381 1.988174
H  -3.145824 0.258982 2.669916
H  -3.30772 -2.305851 0.961997
H  -2.933802 -2.209335 2.691498
H  0.847212 2.730016 1.109567
H  0.122328 2.673502 -0.47655
H  -1.323947 -0.904981 -2.059073
H  -0.919847 -2.431356 -1.225457
H  -2.551358 -1.767926 -1.085895
H  -3.687401 2.388601 1.708714
H  -3.795961 2.640524 -0.06735
H  -5.125791 1.833982 0.820455
H  0.834367 -2.571284 -0.192376
H  5.293289 -1.114962 0.08015
H  5.170198 -0.188401 -1.417049
H  5.039916 2.413704 -1.313102
H  5.087686 3.24625 0.251132
H  5.259628 1.00543 1.433325
H  6.542021 1.116853 0.200266
H  -4.483553 -0.922915 -3.211107
H  -4.422163 0.787293 -3.820458
H  -5.801351 0.219508 -2.781053
H  2.24442 -4.065461 -1.263738
H  2.403875 -4.137469 0.537257
H  3.778702 -4.647133 -0.515068
