program: Gaussian 09
title: 000266926
version: EM64L-G09RevD.01
frameworkgroup: C1[X(C10H14N2O2)]
method: RPBEPBE
basis: SDD
operation: Freq
keyword: #p
keyword: freq=noraman
keyword: PBEPBE/SDD
title: #p freq=noraman PBEPBE/SDD
converged: NO YES NO YES
title: Mulliken charges:
elementType: O O N N C C C C C C C C C C H H H H H H H H H H H H H H
charge: -0.247152 -0.247969 -0.420359 -0.384942 -0.182130 -0.431634 -0.431630 -0.396392 -0.396394 -0.386929 0.471746 -0.466550 0.116124 0.173225 0.219319 0.228814 0.183994 0.183999 0.228822 0.200502 0.210910 0.210912 0.200504 0.192633 0.210348 0.337346 0.261336 0.361546
chargesum: 0.00000
title: Mulliken charges with hydrogens summed into heavy atoms:
elementType: O O N N C C C C C C C C C C
charge: -0.247152 -0.247969 -0.083013 -0.023396 0.037189 -0.018826 -0.018809 0.015021 0.015022 0.016052 0.471746 -0.205213 0.116124 0.173225
polarizability: 1.61920182e+02 -8.27529851e+00 1.30417180e+02 3.02344284e-03 6.71270936e-03 8.67542550e+01
1716.lowfreq: -13.6424 -10.7591 -0.0005 0.0004 0.0008 6.6782 25.1709 70.4762 79.2359
frequency: 24.8426 70.4031 79.1761 162.9525 183.2820 191.1051 216.3290 240.8651 266.5958 326.7677 364.7401 426.4596 434.2336 474.3717 508.1664 535.3872 568.5534 613.7775 634.8163 692.3875 701.0863 713.5261 769.8345 782.0944 786.8821 831.4032 842.0454 876.4933 890.2619 919.4259 931.7204 971.5398 982.2207 1029.5563 1048.4252 1048.7586 1070.2458 1111.0573 1130.2052 1165.4999 1179.8074 1206.4568 1231.2782 1257.7694 1260.5483 1288.9564 1299.4430 1315.5473 1323.0276 1334.0787 1339.3866 1342.0587 1347.8130 1357.0529 1377.8425 1455.8339 1458.1764 1462.4043 1463.6079 1470.4405 1475.4381 1603.9383 1659.2643 1674.5106 2959.6915 2962.9289 2967.8275 2973.2431 2973.9761 3000.4270 3034.4720 3036.2810 3040.3584 3040.5973 3050.4374 3203.5775 3529.3315 3552.1458
redmass: 3.8974 3.5675 4.3895 7.5787 5.3455 3.1622 1.8048 5.6208 4.3659 1.7966 10.6590 3.0364 2.7553 1.8125 7.6632 4.2609 5.5018 1.3060 3.8732 3.6702 2.1672 2.8398 2.0660 1.4633 2.6722 1.6349 2.1814 1.8342 1.4388 2.0555 3.8489 2.4861 3.9624 3.0601 1.4669 1.8572 1.2310 2.3554 2.1805 2.3453 1.4217 3.0279 1.3950 1.3066 1.3003 1.5367 1.2219 1.5414 1.3250 1.3617 1.9886 1.4927 1.5497 1.5410 2.1054 1.9725 1.0892 1.1934 1.0869 1.1813 1.1082 6.9675 6.8901 5.4882 1.0646 1.0648 1.0665 1.0617 1.0611 1.0825 1.0950 1.0958 1.1024 1.0971 1.1031 1.0939 1.0771 1.0775
irintensity: 0.5793 0.8943 0.7251 3.4521 1.0272 0.8654 0.0295 0.5852 0.3957 0.0906 21.5858 0.0865 0.2610 2.4563 14.4491 5.1048 5.3788 43.3328 6.2062 1.6038 49.6713 2.2103 102.4402 1.4864 0.3943 61.8015 8.3715 0.3236 8.8526 0.2960 0.0100 18.5197 23.1845 5.5643 0.2738 0.4573 0.0154 0.0041 7.5260 0.6558 1.0117 21.7812 6.7941 1.8839 3.4097 11.4772 0.9556 48.4484 0.7896 0.1517 52.5950 0.4054 9.3217 4.5541 90.1131 23.9153 3.2121 12.0101 9.5206 53.0848 2.9226 13.4813 585.6307 703.2351 15.2054 31.8103 28.5710 19.7435 43.7633 16.1476 82.5792 63.2165 0.0889 0.8535 111.1533 0.9527 60.8884 54.3524
temp: 298.150 k
press: 1.00000 atm
elementType: 8 8 7 7 6 6 6 6 6 6 6 6 6 6 1 1 1 1 1 1 1 1 1 1 1 1 1 1
symmnumber: 1
zpe: 610857.9 jmol-1
zpe.correction: 0.232663 hartree
zpe.thermalcorrener: 0.245087 hartree
zpe.thermalcorrenthalpy: 0.246031 hartree
zpe.thermalcorrgfe: 0.193081 hartree
zpe.sumelectzpe: -648.408409 hartree
zpe.sumelectthermal: -648.395986 hartree
zpe.sumelectthermalent: -648.395041 hartree
zpe.sumelectthermalfe: -648.447991 hartree
dipole: -6.4077 0.0973 -0.0004
dipole: 6.4084
quadrupole: -93.2623 -96.7818 -82.9483
quadrupole: 3.6112 0.0010 -0.0046
quadrupole: -2.2648 -5.7843 8.0492 3.6112 0.0010 -0.0046
hfenergy: -648.6410722 hartree
pointgroup: C01 [X(C10H14N2O2)]
dipole: 2.521048 -0.0325259 -0.0003561 debye
polarizability: 161.9578965|-8.2031064|130.3794645|-0.0110994|0.0085346|86.7542566 unknown
InChI: InChI=1S/C10H14N2O2/c13-9-6-8(11-10(14)12-9)7-4-2-1-3-5-7/h6-7,11-12H,1-5H2
charge 0 multiplicity 1
28 atoms
O  -2.477465 -2.58921 0.000003
O  -3.574264 1.970592 0.000675
N  -0.758388 -0.996524 -0.000409
N  -2.995495 -0.293154 0.000184
C  1.202199 0.528632 -0.000023
C  1.878295 -0.050664 -1.280432
C  1.878378 -0.051037 1.280183
C  3.39996 0.229495 -1.27675
C  3.400045 0.229117 1.276493
C  4.076763 -0.323527 -0.000232
C  -0.301883 0.324315 -0.000001
C  -1.217142 1.356503 0.000343
C  -2.116663 -1.381396 -0.001251
C  -2.65624 1.101813 0.001099
H  1.371743 1.623165 0.000122
H  1.405956 0.384601 -2.181191
H  1.714558 -1.147984 -1.330472
H  1.714622 -1.148366 1.329913
H  1.406097 0.383976 2.181093
H  3.567796 1.324486 -1.3360
H  3.861549 -0.213593 -2.179528
H  3.86169 -0.214243 2.17911
H  3.567891 1.324089 1.336059
H  4.008294 -1.431353 -0.000394
H  5.15384 -0.070268 -0.00023
H  -0.095586 -1.774249 -0.000463
H  -0.889819 2.396714 0.000441
H  -3.995331 -0.518233 0.00076
