program: Gaussian 09
title: 000266923
version: EM64L-G09RevD.01
frameworkgroup: C1[X(C9H5BrN2O2)]
method: RPBEPBE
basis: SDD
operation: Freq
keyword: #p
keyword: freq=noraman
keyword: PBEPBE/SDD
title: #p freq=noraman PBEPBE/SDD
converged: NO YES NO NO
title: Mulliken charges:
elementType: Br O O N N C C C C C C C C C H H H H H
charge: 0.070250 -0.208047 -0.145135 0.066411 -0.652658 0.451291 -0.245019 -0.123531 0.619659 0.167875 -0.701627 -0.279086 -0.168757 -0.340305 0.293939 0.243641 0.258644 0.356587 0.335868
chargesum: 0.00000
title: Mulliken charges with hydrogens summed into heavy atoms:
elementType: Br O O N N C C C C C C C C C
charge: 0.070250 -0.208047 -0.145135 0.066411 0.039797 0.451291 -0.245019 -0.123531 0.619659 0.167875 -0.701627 0.014854 0.074884 -0.081661
polarizability: 2.06849570e+02 5.76211902e-01 1.70361266e+02 8.22850542e-03 5.59408890e-03 4.79913084e+01
1716.lowfreq: -0.0005 -0.0003 0.0002 2.8219 5.7072 9.3400 53.5057 81.9331 118.5021
frequency: 53.5037 81.9227 118.5014 158.8232 168.3244 226.0704 264.7079 276.3570 343.6833 368.7124 399.0108 399.2378 432.4780 474.2052 522.9628 553.4356 597.9276 638.1771 641.3426 694.3333 696.7816 752.6442 763.2166 826.4098 835.0385 899.2518 965.9749 984.4296 1007.9697 1048.4853 1071.3790 1085.9983 1164.4908 1208.4485 1264.1399 1292.0079 1321.8107 1374.4266 1408.3820 1431.8558 1527.3303 1546.8190 1556.0082 1576.0508 1585.1172 1634.6273 3138.9812 3158.0731 3177.8273 3495.7367 3652.5053
redmass: 10.8226 5.8972 7.1312 12.1312 6.5859 13.1134 6.0086 6.9602 4.2752 10.2363 4.3294 9.1282 4.2349 11.1998 1.8589 8.3031 1.9966 1.1282 7.3942 6.0633 3.7642 8.1801 5.9022 1.5976 5.4684 5.5096 1.5074 7.0848 1.4132 2.6483 2.6284 2.0243 1.9960 2.1189 4.2247 2.5700 10.6795 4.2043 2.7712 2.2955 5.3476 6.7225 5.2981 4.1548 2.3521 4.2587 1.0897 1.0910 1.1000 1.0454 1.1037
irintensity: 5.1549 0.7126 4.9176 0.1412 0.3765 3.8923 2.0043 0.6781 1.1178 17.9709 0.0379 4.1323 1.9650 1.8663 42.1117 5.7358 76.9321 153.8468 7.2351 2.9120 53.5608 52.5934 3.0518 25.2881 17.5263 9.2093 1.4708 21.6650 1.3820 25.4732 15.3435 86.2203 2.2337 13.4001 108.3493 7.1416 0.1477 186.7129 21.1820 30.0843 37.5690 431.3899 91.7253 10.1508 28.6742 355.4373 10.8848 4.2607 17.5621 125.2595 57.6209
temp: 298.150 k
press: 1.00000 atm
elementType: 35 8 8 7 7 6 6 6 6 6 6 6 6 6 1 1 1 1 1
symmnumber: 1
zpe: 328171.2 jmol-1
zpe.correction: 0.124994 hartree
zpe.thermalcorrener: 0.136411 hartree
zpe.thermalcorrenthalpy: 0.137355 hartree
zpe.thermalcorrgfe: 0.086353 hartree
zpe.sumelectzpe: -618.396648 hartree
zpe.sumelectthermal: -618.385230 hartree
zpe.sumelectthermalent: -618.384286 hartree
zpe.sumelectthermalfe: -618.435288 hartree
dipole: 1.9043 4.7206 -0.0003
dipole: 5.0903
quadrupole: -65.5498 -98.7845 -90.2852
quadrupole: -9.7038 0.0023 -0.0035
quadrupole: 19.3233 -13.9113 -5.4120 -9.7038 0.0023 -0.0035
hfenergy: -618.5216415 hartree
pointgroup: C01 [X(C9H5Br1N2O2)]
dipole: 0.2433113 1.9878309 -0.000315 debye
dipolederiv: -0.654578 -0.3553978 0.0003528 -0.2799099 -0.1771026 0.0000963 0.0004655 0.0002055 0.016607 -0.6165726 0.0017763 0.0000489 0.0170251 -1.157665 0.0007026 -0.0000097 -0.001031 -0.3147101 -0.4217786 -0.0062935 -0.000006 0.1844219 -0.9022709 -0.0007687 -0.0002956 0.0004837 -0.2867525 -0.5688718 0.0794128 -0.0000912 0.0175049 -0.1827023 0.0000356 -0.0001261 -0.0000552 -0.2103277 -0.8206302 0.8302702 -0.0001207 0.4511058 -0.7332146 -0.0003125 0.0001046 -0.0008112 -0.6107199 -0.6816855 0.261938 -0.0000308 0.1064178 -0.2610813 -0.0000343 -0.0005898 -0.0002277 0.085254 0.1210878 -0.2473218 0.0001048 0.0165687 0.1342976 -0.0001032 -0.0002533 0.0004334 0.0451278 1.4622673 0.3797321 -0.0001477 -0.0285762 1.3347309 -0.0005306 -0.0000052 0.0007574 0.1504519 -0.0971976 -1.262564 0.0001479 -1.2454488 0.4126473 0.0006288 0.0005058 0.0007256 0.2115964 0.8002672 -0.4073407 -0.0001471 -0.5742753 0.9642979 0.0008711 0.0006265 -0.0002619 0.2291688 0.464429 0.9507934 -0.0005673 1.324907 -0.2834503 -0.0006858 -0.0005944 -0.0003206 -0.2684871 0.208443 -0.1284506 0.0000473 0.0695521 0.1589714 0.0000047 -0.0001289 -0.0000854 -0.0804057 -0.0287499 0.150815 0.0001043 0.3307678 -0.2153815 0.0001041 0.0003358 0.0001119 -0.1054105 0.3002103 -0.0994898 0.000227 -0.2823776 0.2731886 -0.0000779 0.0001469 -0.0001183 -0.0400133 0.1310407 0.0427186 -0.000011 -0.0278347 0.0116728 -0.0000149 -0.0000836 -0.0000078 0.1483789 -0.068594 -0.0631708 -0.0000747 -0.0801669 0.0739516 -0.0000408 -0.0000992 -0.0000458 0.1609209 -0.0731563 0.0636179 -0.0000716 0.086667 0.0532539 0.0000465 -0.0002422 0.000076 0.1354847 0.2744445 -0.086187 0.0001213 -0.0412004 0.3150837 0.0000016 0.0001455 -0.0000584 0.363122 0.2696245 -0.1048583 0.0001136 -0.0451483 0.1807728 0.0000775 0.0000975 0.0002298 0.3707144 unknown
polarizability: 204.1201202|9.6163937|173.0907137|-0.0221282|-0.0045789|47.9913109 unknown
InChI: InChI=1S/C9H5BrN2O2/c10-5-6(11)8(13)4-2-1-3-12-7(4)9(5)14/h1-3H,11H2
charge 0 multiplicity 1
19 atoms
Br -3.49471 -1.53576 0.001229
O  -0.441363 2.780336 0.000226
O  -0.614941 -2.725756 -0.000022
N  1.887635 -1.488122 -0.000213
N  -2.850635 1.590299 0.000739
C  0.803748 0.706172 -0.00087
C  0.762178 -0.719054 -0.00082
C  -0.439605 1.508031 -0.00162
C  -1.754865 0.775095 -0.000274
C  -0.573151 -1.4613 -0.001512
C  -1.776117 -0.616666 -0.000313
C  2.064313 1.353184 -0.000216
C  3.23029 0.564404 0.000395
C  3.091984 -0.845816 0.000367
H  2.099448 2.446968 -0.000239
H  4.225294 1.018542 0.000895
H  3.974381 -1.495677 0.00085
H  -2.689853 2.599789 0.000464
H  -3.792631 1.20313 0.001635
