program: Gaussian 09
title: 000266922
version: EM64L-G09RevD.01
frameworkgroup: C1[X(C6H7N5O3)]
method: RPBEPBE
basis: SDD
operation: Freq
keyword: #pfreq=noraman
keyword: PBEPBE/SDD
title: #p freq=noraman PBEPBE/SDD
converged: NO NO NO NO
title: Mulliken charges:
elementType: O O O N N N N N C C C C C C H H H H H H H
charge: -0.237483 -0.245761 -0.230056 -0.424586 -0.395562 0.047876 -0.401974 -0.639129 0.433600 -0.395064 0.135688 0.184623 -0.331079 0.315148 0.389694 0.253457 0.363200 0.229063 0.282350 0.309895 0.356099
chargesum: 0.00000
title: Mulliken charges with hydrogens summed into heavy atoms:
elementType: O O O N N N N N C C C C C C
charge: -0.237483 -0.245761 -0.230056 -0.034892 -0.032361 0.047876 -0.119624 0.026865 0.433600 -0.141607 0.135688 0.184623 -0.102016 0.315148
polarizability: 2.30763158e+02 -1.33601466e+01 1.25445396e+02 -9.50718843e-05 -7.29828306e-06 4.49998164e+01
1716.lowfreq: -0.0012 -0.0006 0.0009 2.8324 6.8234 6.8754 36.2945 51.3281 57.3567
frequency: 36.1813 51.3259 57.3495 136.5018 166.9366 168.8863 187.8308 225.8827 258.5565 292.5244 363.7327 376.3345 390.0344 475.8325 506.0305 521.2274 528.0694 574.7024 594.4396 628.2865 662.9792 676.0172 699.7326 710.3439 712.7010 757.7498 790.7293 820.5416 898.1027 910.2176 940.1942 977.9434 1033.7086 1050.0450 1143.6545 1190.9809 1209.4847 1287.3202 1314.6541 1332.5070 1344.9657 1367.4049 1481.7804 1508.4708 1564.7874 1609.3700 1612.7798 1647.8334 1676.1894 1697.3875 3040.0732 3203.1624 3380.3607 3493.3554 3530.6833 3536.6009 3689.9675
redmass: 5.2606 6.3701 7.9010 6.1966 4.8192 5.4056 7.9760 2.2536 6.9412 4.2534 10.3027 1.5559 7.3466 3.9234 8.2462 1.1488 5.7150 6.3718 1.2803 3.4125 5.6970 2.8811 2.2510 7.7678 6.0272 1.6417 1.4462 1.6520 1.5603 3.3074 3.5801 3.6179 3.0466 2.4217 3.6362 2.7497 2.9609 2.2395 1.8020 1.7617 2.4198 2.0071 2.6730 2.2100 8.3819 5.4181 1.2453 6.5063 5.7320 5.8723 1.0902 1.0938 1.0755 1.0780 1.0772 1.0463 1.1037
irintensity: 16.7433 0.1981 4.3597 0.8861 7.3326 0.0303 5.6606 4.9010 1.8990 2.5938 26.0848 76.0495 1.4048 2.9479 15.6664 230.2858 5.9936 13.0990 133.7012 4.6696 16.5201 1.5754 30.2704 39.0302 1.3767 22.1127 117.9667 97.2740 69.8207 15.1289 15.6334 14.2541 15.8218 24.0586 185.2442 63.9860 24.2507 678.8966 32.0456 63.6923 59.5777 90.9798 176.4910 304.8304 174.8025 14.0435 99.6473 474.4445 561.8649 407.6350 31.3587 1.1710 0.9821 98.6875 72.0071 83.2550 54.3387
temp: 298.150 k
press: 1.00000 atm
elementType: 8 8 8 7 7 7 7 7 6 6 6 6 6 6 1 1 1 1 1 1 1
symmnumber: 1
zpe: 389058.2 jmol-1
zpe.correction: 0.148184 hartree
zpe.thermalcorrener: 0.161000 hartree
zpe.thermalcorrenthalpy: 0.161944 hartree
zpe.thermalcorrgfe: 0.107680 hartree
zpe.sumelectzpe: -731.273445 hartree
zpe.sumelectthermal: -731.260630 hartree
zpe.sumelectthermalent: -731.259686 hartree
zpe.sumelectthermalfe: -731.313950 hartree
dipole: -8.1986 -6.4617 0.0002
dipole: 10.4389
quadrupole: -70.4195 -88.5784 -82.4513
quadrupole: 23.2877 -0.0014 0.0002
quadrupole: 10.0636 -8.0954 -1.9683 23.2877 -0.0014 0.0002
hfenergy: -731.4216297 hartree
pointgroup: C01 [X(C6H7N5O3)]
dipole: 3.2220669 -2.5466502 -0.0012316 debye
dipolederiv: -0.5019079 0.1014839 0.0000471 0.2980925 -1.3532637 -0.0004952 0.0001662 -0.0005701 -0.3880825 -1.3160225 -0.4303897 -0.0003213 -0.227395 -0.6854513 -0.0001975 -0.0001593 -0.0001779 -0.3734449 -0.6967999 0.0089018 0.0000155 -0.3369523 -1.0413698 -0.0004858 -0.0001232 -0.0002405 -0.3571664 -0.8633871 0.5900451 0.0002897 0.1667371 -1.1058811 -0.0004422 0.0000493 -0.000398 -0.2881861 -0.5434085 -0.3404697 -0.0002121 -0.0692088 -1.1648416 -0.0004407 -0.0000561 -0.000471 -0.3598698 1.5372638 0.2256488 0.0002809 -0.3757091 -0.3374664 -0.0001817 0.0000097 -0.0001335 -0.0591235 -2.2423953 -0.5277411 -0.0003964 -0.198023 -0.1954178 0.0001059 -0.0003076 0.0000156 -0.3443675 -1.58625 0.2473207 0.0000146 0.3048701 -0.3850871 0.000212 0.0001577 0.0001795 -0.7725042 0.8130028 0.0516735 0.0000879 0.0586034 0.8875243 0.0004276 0.000092 0.0004283 0.1198355 -1.1985046 -0.2140974 -0.0001886 0.211256 -0.1673604 0.0000522 0.000039 0.0000219 -0.2464905 1.1744841 -0.2687186 -0.0000903 -0.3726556 1.9416314 0.0008534 -0.0001487 0.0008932 0.3341443 1.9268411 0.399071 0.0003577 -0.193427 1.2370002 0.0005214 0.0000072 0.0005559 0.2682347 -0.3858713 0.0356422 -0.0000005 -0.3938263 0.2795036 0.0001727 -0.0003109 0.0002055 -0.1349301 2.8005008 0.0885821 0.0001166 0.9802174 1.5894507 0.0008249 0.0004894 0.0006442 0.3638979 0.2980754 -0.0168719 -0.0000118 0.0187424 0.2248215 -0.000055 0.0000058 -0.0000591 0.3272945 0.0788036 0.0369636 0.0000097 0.0675658 -0.0002233 -0.0000962 0.0000277 -0.0000963 0.1896602 0.236614 -0.0219276 -0.0000177 -0.03901 0.1529009 -0.0001102 -0.0000269 -0.0001107 0.3450529 -0.0154965 0.0423874 0.000001 0.0775743 -0.1248482 -0.0001672 0.0000206 -0.0001623 0.203175 -0.0480244 -0.0020612 -0.0000446 0.0079383 -0.0288961 -0.0002015 -0.0000564 -0.0002153 0.3519429 0.2506421 -0.0110194 0.0000333 -0.0420339 0.1008486 -0.0001718 0.0000522 -0.0001817 0.412911 0.2818403 0.0055763 0.0000292 0.0566436 0.1764256 -0.000125 0.0000722 -0.0001276 0.4080165 unknown
polarizability: 230.7996349|13.2155266|125.4088932|0.0204743|0.0446483|44.9998421 unknown
InChI: InChI=1S/C6H7N5O3/c7-5(13)11-8-2-3-1-4(12)10-6(14)9-3/h1-2,9-11H,7H2
charge 0 multiplicity 1
21 atoms
O  -2.165653 2.684823 0.001466
O  -4.295837 -1.493204 -0.000993
O  3.788702 1.412722 0.001103
N  -0.852235 0.741701 0.000444
N  -3.194831 0.571764 0.000195
N  1.62169 -0.335644 0.000094
N  2.905904 -0.783757 0.000017
N  5.223512 -0.432151 0.000176
C  -0.737977 -0.645414 -0.000301
C  -1.864699 -1.45112 -0.000828
C  -2.080367 1.42949 0.000724
C  -3.200495 -0.859767 -0.000627
C  0.620144 -1.191182 -0.00048
C  3.973212 0.174347 0.000646
H  0.009853 1.299738 0.000823
H  -1.788285 -2.539222 -0.001396
H  -4.11148 1.02993 0.000417
H  0.728279 -2.289428 -0.00104
H  3.114666 -1.793594 -0.000509
H  5.377476 -1.43878 -0.000409
H  6.031122 0.186547 0.000379
