program: Gaussian 09
title: 000266920
version: EM64L-G09RevD.01
frameworkgroup: C1[X(C11H9N5O4)]
method: RPBEPBE
basis: SDD
operation: Freq
keyword: #p
keyword: freq=noraman
keyword: PBEPBE/SDD
title: #p freq=noraman PBEPBE/SDD
converged: NO NO NO NO
title: Mulliken charges:
elementType: O O O O N N N N N C C C C C C C C C C C H H H H H H H H H
charge: -0.238452 -0.239714 -0.215290 -0.211413 -0.423394 -0.430998 -0.392367 -0.001680 0.021354 0.514181 0.433594 -0.396464 -0.333866 0.390947 -0.337854 -0.334148 -0.387777 -0.344340 0.136104 0.185389 0.234339 0.269199 0.367207 0.256335 0.290787 0.291605 0.296465 0.233464 0.366789
chargesum: 0.00000
title: Mulliken charges with hydrogens summed into heavy atoms:
elementType: O O O O N N N N N C C C C C C C C C C C
charge: -0.238452 -0.239714 -0.215290 -0.211413 -0.056187 -0.134534 -0.025578 -0.001680 0.021354 0.514181 0.433594 -0.162126 -0.064667 0.390947 -0.047067 -0.042543 -0.131443 -0.110876 0.136104 0.185389
polarizability: 4.69903474e+02 2.70624103e+01 1.86513508e+02 6.62291898e-03 -1.61479858e-02 6.41613697e+01
1716.lowfreq: -0.0010 -0.0008 -0.0003 4.4608 6.4457 9.7416 26.6982 36.6718 38.4391
frequency: 26.6679 36.6715 38.2306 79.0432 80.5304 123.5606 146.3363 167.1724 173.5863 194.3590 242.0954 267.9057 285.1534 318.2576 347.1316 356.8156 392.6039 417.0854 496.5579 499.5442 504.9275 523.8850 527.6825 592.3795 617.1546 623.8777 643.9801 662.9856 664.3364 668.6880 696.9991 712.3536 733.8534 739.9340 771.4092 777.8268 817.2792 829.4944 855.9570 860.3720 891.0092 938.2964 977.8800 980.6033 994.0357 997.6159 1033.1192 1094.8524 1104.6600 1134.0579 1171.5738 1186.6903 1211.8999 1217.3201 1281.6314 1287.9499 1314.7515 1325.7941 1344.3609 1354.2920 1369.0369 1409.0550 1434.2945 1480.9311 1487.2920 1528.9769 1548.4872 1597.9751 1607.4108 1613.4947 1640.7054 1674.0044 3050.2214 3131.3471 3179.7172 3188.7862 3199.0824 3206.5927 3398.7843 3528.6397 3531.8875
redmass: 9.6595 9.6458 5.7050 8.0188 7.4422 8.5338 7.8138 6.5936 5.3008 10.0389 7.5502 3.3893 4.9874 4.8915 8.7547 9.3471 7.7814 2.9839 8.6634 3.0172 8.4379 7.1332 5.5561 7.2710 2.5068 7.1771 1.4913 6.9676 3.9986 2.7272 1.9532 6.6195 4.5209 1.4333 1.9302 8.7315 1.7392 1.3038 5.0620 1.5982 1.5655 4.1012 3.6672 1.3382 2.9721 1.3397 3.0428 3.2093 1.7455 2.2428 1.4187 2.2252 3.5396 4.6905 2.4933 1.3222 1.6461 1.7094 2.5295 6.5651 2.0475 5.1208 4.2866 3.5564 2.5454 3.0706 3.8823 6.3751 5.0461 6.2485 6.3743 5.7012 1.0900 1.0908 1.0892 1.0946 1.0963 1.0938 1.0751 1.0770 1.0777
irintensity: 1.6129 2.8073 0.7580 0.0101 0.0945 1.2303 1.8203 5.4743 0.6484 2.1408 1.8691 17.0201 12.9896 1.2484 1.7051 30.4523 6.0960 0.0436 5.7690 18.3432 12.1856 3.8474 4.4440 3.4093 10.8607 2.2216 40.4541 0.3921 18.9903 4.8589 57.3370 2.5209 7.2964 5.1679 140.2526 35.6024 60.4537 12.1673 0.0295 90.2759 60.0663 4.6581 15.6530 1.1648 0.6049 0.1230 36.3804 19.7747 82.0018 249.1989 221.2455 22.9937 166.6059 526.9553 216.6726 7.8652 14.3327 68.8633 118.4621 70.0522 153.9976 47.9701 16.7696 183.7151 25.5748 10.7435 462.0720 20.5529 10.6681 503.5490 517.9517 649.8612 24.9488 9.6605 1.4747 1.7569 2.6176 2.0256 3.3221 104.2516 55.8217
temp: 298.150 k
press: 1.00000 atm
elementType: 8 8 8 8 7 7 7 7 7 6 6 6 6 6 6 6 6 6 6 6 1 1 1 1 1 1 1 1 1
symmnumber: 1
zpe: 533318.0 jmol-1
zpe.correction: 0.203130 hartree
zpe.thermalcorrener: 0.219844 hartree
zpe.thermalcorrenthalpy: 0.220788 hartree
zpe.thermalcorrgfe: 0.156684 hartree
zpe.sumelectzpe: -997.744215 hartree
zpe.sumelectthermal: -997.727501 hartree
zpe.sumelectthermalent: -997.726557 hartree
zpe.sumelectthermalfe: -997.790661 hartree
dipole: -0.2666 -6.4638 -0.0109
dipole: 6.4693
quadrupole: -193.7571 -110.9785 -116.5918
quadrupole: -11.9779 -0.0453 -0.0106
quadrupole: -53.3146 29.4640 23.8507 -11.9779 -0.0453 -0.0106
hfenergy: -997.9473449 hartree
pointgroup: C01 [X(C11H9N5O4)]
dipole: -0.0786034 -2.5439917 -0.0049915 debye
polarizability: 469.3137883|29.9856129|187.1031927|0.0241916|0.0179763|64.161371 unknown
InChI: InChI=1S/C11H9N5O4/c17-10-5-8(13-11(18)14-10)6-12-15-7-1-3-9(4-2-7)16(19)20/h1-6,13-15H
charge 0 multiplicity 1
29 atoms
O  -3.779139 2.887979 0.000665
O  -6.644549 -0.825489 0.001818
O  6.742103 0.036521 0.003728
O  5.805164 2.12393 0.003539
N  -2.853237 0.736778 -0.000231
N  0.554244 -1.536592 -0.000483
N  -5.185998 1.002803 0.00067
N  -0.597912 -0.809638 -0.00048
N  5.719541 0.832013 -0.001095
C  1.81789 -0.920451 -0.000613
C  -2.989776 -0.6501 -0.000103
C  2.972719 -1.752983 -0.000544
C  1.956061 0.495607 -0.000802
C  4.372516 0.226879 -0.000897
C  4.253865 -1.181121 -0.000671
C  3.236905 1.0688 -0.000918
C  -4.248153 -1.232273 0.000359
C  -1.76218 -1.438813 -0.000247
C  -3.933674 1.638359 0.000081
C  -5.451677 -0.403059 0.000322
H  2.86441 -2.844383 -0.000391
H  1.062274 1.122142 -0.000832
H  -1.909684 1.134571 -0.000358
H  -4.374334 -2.315521 0.000746
H  5.157162 -1.795884 -0.000636
H  3.375671 2.152922 -0.001073
H  0.51788 -2.566652 -0.000316
H  -1.864177 -2.536769 -0.000098
H  -6.004215 1.620228 0.001363
