program: Gaussian 09
title: 000266919
version: EM64L-G09RevD.01
frameworkgroup: C1[X(C11H9N5O3)]
method: RPBEPBE
basis: SDD
operation: Freq
keyword: #p
keyword: freq=noraman
keyword: PBEPBE/SDD
title: #p freq=noraman PBEPBE/SDD
converged: YES YES NO NO
title: Mulliken charges:
elementType: O O O N N N N N C C C C C C C C C C C H H H H H H H H H
charge: -0.232091 -0.239394 -0.197051 -0.424541 -0.395291 -0.421460 0.058009 0.005062 0.433756 -0.386967 0.138253 0.185388 0.282511 -0.329223 0.192976 -0.277308 -0.307218 -0.317193 -0.322764 0.390041 0.256555 0.366022 0.235284 0.274452 0.223273 0.305139 0.253950 0.249829
chargesum: 0.00000
title: Mulliken charges with hydrogens summed into heavy atoms:
elementType: O O O N N N N N C C C C C C C C C C C
charge: -0.232091 -0.239394 -0.197051 -0.034500 -0.029270 -0.116320 0.058009 0.005062 0.433756 -0.130412 0.138253 0.185388 0.282511 -0.093939 0.192976 -0.002856 -0.083945 -0.063243 -0.072935
polarizability: 3.40602886e+02 2.55358840e+01 1.76695949e+02 -1.11385996e+00 -4.88708743e+00 7.07930066e+01
1716.lowfreq: -2.9779 -0.0005 -0.0003 0.0004 2.9161 6.8417 26.4332 32.4848 38.5104
frequency: 26.4254 32.4399 38.4715 60.2218 104.9470 120.9800 165.1621 173.5731 186.7541 203.9940 241.9144 270.7131 320.2427 349.7339 362.5003 375.7032 411.5638 437.2849 500.4700 510.2174 533.5201 584.4624 617.0545 641.8517 659.2078 669.4226 674.5222 692.2706 700.4991 717.9855 752.3582 759.0285 787.4101 822.6182 837.1075 871.3604 889.6679 906.9042 938.3127 957.7064 966.7628 975.3145 989.1803 1025.4435 1039.4706 1062.8354 1090.5685 1134.7021 1185.5341 1210.0282 1220.2676 1239.9115 1299.6313 1313.7802 1319.9542 1330.8484 1344.7265 1367.7707 1400.0455 1460.9052 1480.9712 1506.7812 1548.0292 1560.0557 1579.5419 1607.8185 1630.0913 1646.7446 1681.1935 3040.1217 3127.9466 3146.4907 3152.6519 3175.7294 3203.3525 3400.8731 3495.9519 3530.0908
redmass: 6.7957 5.7907 7.7699 7.3340 7.3609 7.2192 8.3796 4.9761 7.3013 9.3611 6.3556 3.0410 5.5717 10.1524 2.6026 8.2486 7.2814 6.6647 6.8370 6.5783 5.6613 6.9900 2.1766 1.6362 5.9807 7.1381 2.8416 3.9442 2.3907 6.1163 2.8372 1.5557 1.4891 1.6783 1.6558 7.0502 1.2628 1.5692 4.3060 3.5096 1.8062 3.4158 1.4469 4.2706 3.7274 2.1000 1.6543 3.6265 2.3869 3.1382 1.3592 2.9834 7.0719 1.7913 1.5996 1.4635 2.5198 1.8745 1.8479 1.8924 2.7071 2.1146 7.3444 8.3880 5.6260 6.5618 8.2219 6.4826 5.9425 1.0906 1.0878 1.0897 1.0972 1.0971 1.0939 1.0757 1.0780 1.0772
irintensity: 0.2908 0.6874 1.6658 6.2963 3.8068 3.7005 8.7734 1.5060 1.8152 0.7900 15.2740 14.3428 4.5280 13.4975 2.6856 11.6883 1.6698 2.8563 8.0079 14.7368 3.2156 11.1155 27.5348 35.0792 2.3702 44.4280 1.4576 11.1580 65.7272 1.9258 12.8484 14.6974 135.4645 87.5439 32.4284 19.5958 4.5869 58.7570 0.5627 0.4649 0.1697 10.9356 1.9323 53.0226 7.1572 10.5010 17.3281 232.8482 53.1064 29.0195 60.6714 414.1168 0.3216 49.8878 4.2420 4.3370 98.0956 84.4252 17.1068 10.7499 193.9061 284.8056 26.2036 56.1882 12.2440 73.6128 102.9624 433.3228 733.5824 26.0700 9.9519 25.3269 12.2476 5.2481 1.4124 1.0770 99.0540 76.4900
temp: 298.150 k
press: 1.00000 atm
elementType: 8 8 8 7 7 7 7 7 6 6 6 6 6 6 6 6 6 6 6 1 1 1 1 1 1 1 1 1
symmnumber: 1
zpe: 522760.3 jmol-1
zpe.correction: 0.199109 hartree
zpe.thermalcorrener: 0.215026 hartree
zpe.thermalcorrenthalpy: 0.215970 hartree
zpe.thermalcorrgfe: 0.153363 hartree
zpe.sumelectzpe: -922.668693 hartree
zpe.sumelectthermal: -922.652776 hartree
zpe.sumelectthermalent: -922.651832 hartree
zpe.sumelectthermalfe: -922.714439 hartree
dipole: 4.7517 -4.4556 -0.5417
dipole: 6.5364
quadrupole: -147.9525 -116.8074 -109.5424
quadrupole: -2.8226 -1.7288 -4.3515
quadrupole: -23.1850 7.9601 15.2250 -2.8226 -1.7288 -4.3515
hfenergy: -922.867802 hartree
pointgroup: C01 [X(C11H9N5O3)]
dipole: 1.873213 1.7550834 0.1549019 debye
polarizability: 340.4546838|-25.8482199|176.3097228|3.1276206|-8.941685|71.3274347 unknown
InChI: InChI=1S/C11H9N5O3/c17-9-5-8(14-11(19)15-9)6-13-16-10(18)7-1-3-12-4-2-7/h1-6,14-16H
charge 0 multiplicity 1
28 atoms
O  -4.300955 -2.563746 -0.248478
O  -5.965029 1.806145 0.111208
O  1.799558 -1.900505 0.063032
N  -2.784812 -0.784339 -0.067064
N  -5.097474 -0.360469 -0.066415
N  1.11777 0.346239 0.070031
N  -0.210758 0.020204 0.030656
N  6.259336 0.610598 -0.019145
C  -2.523453 0.577855 0.05699
C  -3.555708 1.496835 0.122622
C  -4.079769 -1.33212 -0.1348
C  -4.949085 1.054564 0.061713
C  3.516321 -0.180909 0.009603
C  -1.114948 0.973138 0.112324
C  2.095458 -0.680742 0.041567
C  4.530593 -1.048835 0.485029
C  3.905498 1.084673 -0.501428
C  5.872482 -0.61283 0.456541
C  5.276341 1.430386 -0.494433
H  -1.98775 -1.430094 -0.110763
H  -3.366271 2.566778 0.219625
H  -6.056682 -0.718412 -0.113356
H  -0.892912 2.04897 0.217297
H  4.260762 -2.040915 0.85864
H  3.186326 1.783941 -0.943309
H  1.419488 1.32535 0.180771
H  6.678842 -1.256447 0.823549
H  5.61083 2.395686 -0.89011
