program: Gaussian 09
title: 000266917
version: EM64L-G09RevD.01
frameworkgroup: C1[X(C10H14N2O3)]
method: RPBEPBE
basis: SDD
operation: Freq
keyword: #p
keyword: freq=noraman
keyword: PBEPBE/SDD
title: #p freq=noraman PBEPBE/SDD
converged: YES YES NO NO
title: Mulliken charges:
elementType: O O O N N C C C C C C C C C C H H H H H H H H H H H H H H
charge: -0.279133 -0.262651 -0.260128 -0.207817 -0.040903 -0.017611 -0.454041 -0.462904 -0.306083 -0.241081 0.026471 0.266355 0.071451 -0.762350 -0.503394 0.288659 0.229270 0.282476 0.232237 0.244371 0.223452 0.221790 0.297667 0.243303 0.212086 0.240205 0.245084 0.246847 0.226373
chargesum: 0.00000
title: Mulliken charges with hydrogens summed into heavy atoms:
elementType: O O O N N C C C C C C C C C C
charge: -0.279133 -0.262651 -0.260128 -0.207817 -0.040903 0.271048 0.057705 0.013704 0.139159 0.056586 0.026471 0.266355 0.071451 -0.066756 0.214909
polarizability: 1.77257988e+02 -6.71216901e+00 1.37055416e+02 -4.93634857e+00 1.85055544e+00 8.32183432e+01
1716.lowfreq: -12.4000 -10.0881 -0.0010 -0.0010 -0.0008 10.5614 32.1983 60.0290 71.9150
frequency: 31.9865 59.9718 71.8380 112.8634 127.4737 129.3185 143.2543 176.7836 199.5979 205.9906 239.7692 273.7789 281.9367 307.6369 396.6485 446.9711 461.3658 477.2717 525.7608 589.2130 619.1498 652.8241 701.3602 711.5564 733.7161 752.1365 826.4369 839.2890 880.7516 886.9065 915.9762 918.1748 935.6843 952.3842 990.1901 1018.9690 1030.3992 1050.3953 1058.8110 1092.2181 1109.4837 1113.6443 1146.4028 1153.5229 1162.3396 1196.9568 1212.2235 1243.5108 1270.3384 1294.7556 1301.0031 1315.2561 1337.3334 1373.6419 1384.7522 1405.8888 1444.1781 1445.7734 1454.9556 1462.8773 1465.5398 1470.7979 1471.3693 1491.1749 1505.1379 1594.3523 1640.9281 2983.5535 3003.1944 3007.9320 3019.4486 3030.2968 3064.3976 3072.0237 3076.7411 3088.4921 3094.3126 3112.6453 3123.3568 3146.1892 3176.0049
redmass: 3.6159 3.9533 3.1170 1.1164 1.3138 2.3311 2.8753 3.9469 3.3721 2.6732 5.4147 4.3971 3.4231 4.6313 4.1733 4.1400 5.0584 5.4177 4.6924 2.3662 4.8336 4.3646 8.1153 7.0615 7.0096 7.5958 3.0641 2.9455 2.8239 1.8605 1.4386 2.3784 2.5626 4.2937 2.2623 2.6914 2.8269 1.4502 1.8300 3.0685 1.9323 1.2590 1.3218 1.5314 1.7411 4.7168 1.3851 1.3950 1.7963 1.8732 1.4561 1.2717 1.3355 2.1570 1.8542 1.2438 1.4351 1.0871 1.0444 1.0754 1.0834 1.3001 1.1440 1.0930 3.3786 9.5364 7.6996 1.0361 1.0599 1.0286 1.0643 1.0661 1.0978 1.1028 1.0905 1.1002 1.1040 1.1043 1.1003 1.1058 1.0931
irintensity: 0.5212 5.1835 2.2394 0.2106 0.7813 1.8657 6.5330 1.6589 12.1509 5.8642 2.2197 1.9687 6.4705 1.2307 1.2125 0.5856 3.3884 7.7479 6.7546 2.8507 6.1361 6.9890 5.3080 5.0931 10.0382 29.7156 17.1847 3.9965 4.8504 1.6993 23.1653 9.3784 20.8076 8.7044 64.0746 22.3257 200.8195 8.5559 2.3674 42.7872 3.0413 0.1044 23.1665 10.8314 30.3919 147.8235 23.7528 14.0676 40.7235 88.5244 23.0128 7.8873 3.6938 201.6116 25.7876 5.5730 98.4565 23.1319 12.3832 8.4544 15.8103 36.4683 23.0277 4.0012 98.8685 270.7069 399.5379 33.9642 76.6717 39.4699 16.6227 16.6832 16.7429 25.0523 3.4173 19.5313 43.9407 22.6635 15.5514 22.8752 5.5400
temp: 298.150 k
press: 1.00000 atm
elementType: 8 8 8 7 7 6 6 6 6 6 6 6 6 6 6 1 1 1 1 1 1 1 1 1 1 1 1 1 1
symmnumber: 1
zpe: 611850.9 jmol-1
zpe.correction: 0.233042 hartree
zpe.thermalcorrener: 0.247670 hartree
zpe.thermalcorrenthalpy: 0.248615 hartree
zpe.thermalcorrgfe: 0.190797 hartree
zpe.sumelectzpe: -723.489487 hartree
zpe.sumelectthermal: -723.474859 hartree
zpe.sumelectthermalent: -723.473914 hartree
zpe.sumelectthermalfe: -723.531732 hartree
dipole: 1.4942 3.9889 2.0497
dipole: 4.7271
quadrupole: -69.4141 -97.2296 -89.2289
quadrupole: 1.0188 4.4174 -0.1888
quadrupole: 15.8768 -11.9387 -3.9381 1.0188 4.4174 -0.1888
hfenergy: -723.722529 hartree
pointgroup: C01 [X(C10H14N2O3)]
dipole: -0.6489885 -1.6054567 0.6782936 debye
polarizability: 176.477693|-7.9790391|137.403333|7.8491407|1.3268781|83.6507208 unknown
InChI: InChI=1S/C10H14N2O3/c1-7-6-12(8-4-3-5-15-8)10(13)11-9(7)14-2/h6,8H,3-5H2,1-2H3
charge 0 multiplicity 1
29 atoms
O  -2.70812 -0.61265 -1.105137
O  -0.171439 2.550496 -0.181425
O  3.389716 -0.473353 0.375684
N  -0.572217 0.2495 -0.35558
N  1.645494 1.072198 0.112866
C  -2.015933 0.586203 -0.648195
C  -2.767282 1.069251 0.613591
C  -3.316177 -0.24929 1.212612
C  -3.67944 -1.053565 -0.050809
C  -0.107996 -1.049877 -0.363433
C  0.308593 1.380041 -0.136798
C  1.223361 -1.352009 -0.116967
C  2.058247 -0.197014 0.125689
C  1.773009 -2.75821 -0.120275
C  4.276418 0.69133 0.607586
H  -2.004551 1.335285 -1.455427
H  -3.594779 1.730054 0.298532
H  -2.112127 1.639513 1.287314
H  -2.53383 -0.765271 1.797455
H  -4.187418 -0.085895 1.868037
H  -3.572915 -2.146307 0.058688
H  -4.696872 -0.817895 -0.414549
H  -0.85243 -1.812028 -0.605544
H  2.578411 -2.868684 -0.868844
H  0.980256 -3.491271 -0.350325
H  2.215565 -3.017292 0.858892
H  3.933959 1.264688 1.48463
H  4.272828 1.355787 -0.271976
H  5.268167 0.247362 0.776003
