program: Gaussian 09
title: 000266915
version: EM64L-G09RevD.01
frameworkgroup: C1[X(C11H11N3O2)]
method: RPBEPBE
basis: SDD
operation: Freq
keyword: #p
keyword: freq=noraman
keyword: PBEPBE/SDD
title: #p freq=noraman PBEPBE/SDD
converged: YES YES NO NO
title: Mulliken charges:
elementType: O O N N N C C C C C C C C C C C H H H H H H H H H H H
charge: -0.267815 -0.261813 -0.319719 -0.009508 -0.017848 0.218462 0.169612 0.515423 -0.499985 -0.330838 -0.399859 -0.201589 -0.409924 -0.350812 -0.410457 -0.142349 0.284681 0.250599 0.225674 0.236521 0.239158 0.206643 0.251620 0.227313 0.242073 0.278949 0.275788
chargesum: 0.00000
title: Mulliken charges with hydrogens summed into heavy atoms:
elementType: O O N N N C C C C C C C C C C C
charge: -0.267815 -0.261813 -0.043931 -0.009508 -0.017848 0.218462 0.169612 0.515423 -0.215304 -0.080239 -0.174185 0.274091 -0.203281 0.128121 0.110565 -0.142349
polarizability: 2.79636494e+02 -6.36932826e+00 1.48929951e+02 1.53864687e+01 9.91950280e+00 7.65651776e+01
1716.lowfreq: -47.8927 -8.8863 -3.1204 -0.0007 -0.0007 -0.0005 5.0964 24.3773 30.5475
frequency: -47.8299 24.3679 30.5286 61.5060 82.4392 92.6551 155.8959 182.4385 203.0357 239.3525 254.2741 296.5656 350.6415 368.1118 380.2494 425.4509 434.7614 441.5286 493.2201 557.7987 566.3492 612.6123 622.8623 680.4066 719.7003 766.1070 768.9033 791.8226 805.1034 843.5215 890.4161 910.0001 931.4465 932.6462 943.8616 974.4519 980.6115 995.5613 1057.3546 1064.9587 1085.7648 1120.4006 1126.2770 1166.8322 1197.7478 1214.1138 1254.9563 1261.8863 1272.4470 1302.6338 1345.4153 1357.8015 1366.0664 1391.9716 1448.7971 1453.4843 1459.0310 1472.2321 1485.8875 1499.2864 1573.9885 1607.1180 1624.7845 2195.0518 2977.0459 3001.6570 3011.9345 3024.9256 3060.0974 3092.1958 3095.8492 3135.9845 3181.4759 3187.4173 3408.8221
redmass: 2.3269 6.4843 7.8213 2.7206 6.4592 4.2728 7.1445 2.2384 7.0092 5.9534 3.7079 6.1655 5.5777 4.1345 3.7570 3.7193 2.6188 1.9087 6.9841 6.2232 3.5005 4.2378 5.5175 9.5719 4.1659 1.9044 2.4586 5.4115 1.3611 10.7641 1.3643 1.4940 1.5404 3.0541 4.5810 3.2570 3.9866 4.0069 3.8028 1.4625 2.0033 1.0412 1.6282 2.3736 2.0635 1.3382 1.7118 2.1298 1.3337 1.1439 1.6892 1.2570 1.2804 3.1821 1.0946 3.6007 1.1528 2.0663 1.2209 1.9083 6.9491 7.7359 7.9592 12.4115 1.0865 1.0589 1.0542 1.0596 1.1013 1.1179 1.1062 1.0896 1.0952 1.0933 1.0758
irintensity: 16.3330 0.9242 0.3165 6.0276 1.3001 3.3412 9.9309 54.6941 2.4236 11.7052 0.3671 0.9891 0.6573 0.1158 1.3019 10.4517 80.6753 33.9731 8.2007 6.5447 60.1824 12.1085 5.0456 0.4936 2.8559 2.1602 14.8949 13.7889 34.9162 19.4907 0.3505 61.3061 10.7463 8.2000 1.1989 18.9215 146.0524 7.6269 8.1311 4.7330 15.7641 0.4010 75.0360 212.6703 76.9603 21.2503 81.8237 171.6016 28.6790 14.5034 65.1896 23.1439 3.4048 12.7380 4.2056 76.9292 22.9628 156.3162 18.0452 18.5428 71.7612 12.0650 0.4327 32.4123 66.1689 3.8302 139.0433 45.4936 0.7364 33.4477 14.6495 12.2908 7.3115 2.0127 3.0469
temp: 298.150 k
press: 1.00000 atm
elementType: 8 8 7 7 7 6 6 6 6 6 6 6 6 6 6 6 1 1 1 1 1 1 1 1 1 1 1
symmnumber: 1
zpe: 534700.2 jmol-1
zpe.correction: 0.203657 hartree
zpe.thermalcorrener: 0.217831 hartree
zpe.thermalcorrenthalpy: 0.218775 hartree
zpe.thermalcorrgfe: 0.160273 hartree
zpe.sumelectzpe: -739.236322 hartree
zpe.sumelectthermal: -739.222147 hartree
zpe.sumelectthermalent: -739.221203 hartree
zpe.sumelectthermalfe: -739.279705 hartree
dipole: -2.2782 -3.9673 -0.8649
dipole: 4.6559
quadrupole: -111.3404 -87.3171 -94.4051
quadrupole: -28.0802 -0.3902 2.1524
quadrupole: -13.6529 10.3704 3.2824 -28.0802 -0.3902 2.1524
hfenergy: -739.4399786 hartree
pointgroup: C01 [X(C11H11N3O2)]
dipole: 0.9176345 -1.5845669 -0.0500576 debye
polarizability: 279.3844597|4.0661858|149.3627559|17.3664359|8.792081|76.3844073 unknown
InChI: InChI=1S/C11H11N3O2/c12-4-1-5-13-14-7-9-2-3-10-11(6-9)16-8-15-10/h2-3,6-7,13H,1,5,8H2
charge 0 multiplicity 1
27 atoms
O  2.885762 2.10158 0.150361
O  4.674458 0.513513 0.38509
N  -2.827213 -1.236607 -0.823173
N  -1.581424 -0.712479 -0.582608
N  -6.289609 1.865801 0.787653
C  2.386067 0.777976 0.049205
C  3.441797 -0.154366 0.187626
C  0.809219 -1.019909 -0.243535
C  1.069797 0.388616 -0.166453
C  3.217327 -1.530246 0.113622
C  1.878351 -1.949731 -0.104342
C  4.340743 1.964249 0.418206
C  -0.548028 -1.527132 -0.464444
C  -3.956181 -0.319414 -0.757751
C  -4.232939 0.175789 0.703099
C  -5.363692 1.1124 0.768672
H  0.254265 1.106022 -0.27948
H  4.034989 -2.247487 0.217811
H  1.664237 -3.022953 -0.167113
H  4.561639 2.359372 1.425628
H  4.903784 2.478659 -0.378507
H  -0.663643 -2.627725 -0.534263
H  -3.749239 0.555086 -1.398216
H  -4.846854 -0.833622 -1.158374
H  -4.438375 -0.68921 1.361798
H  -3.316493 0.668172 1.077907
H  -2.990746 -2.251753 -0.775723
