program: Gaussian 09
title: 000266912
version: EM64L-G09RevD.01
frameworkgroup: C1[X(C10H9NO3)]
method: RPBEPBE
basis: SDD
operation: Freq
keyword: #p
keyword: freq=noraman
keyword: PBEPBE/SDD
title: #p freq=noraman PBEPBE/SDD
converged: YES YES NO NO
title: Mulliken charges:
elementType: O O O N C C C C C C C C C C H H H H H H H H H
charge: -0.289033 -0.493470 -0.292399 -0.354446 0.106992 0.320700 0.179409 -0.172519 0.235898 -0.284459 -0.477548 -0.217781 -0.206029 -0.499226 0.236968 0.354672 0.299332 0.251908 0.238395 0.369998 0.211226 0.240998 0.240412
chargesum: 0.00000
title: Mulliken charges with hydrogens summed into heavy atoms:
elementType: O O O N C C C C C C C C C C
charge: -0.289033 -0.123472 -0.292399 0.000226 0.106992 0.320700 0.179409 -0.172519 0.235898 0.014873 -0.240580 0.034127 0.032366 0.193410
polarizability: 2.14449012e+02 5.96835247e+00 1.52554247e+02 1.63732492e-02 -9.96336810e-03 5.37700445e+01
1716.lowfreq: -67.8857 -8.8186 -8.0752 -5.2878 -0.0007 0.0004 0.0006 78.5519 123.0002
frequency: -67.8744 78.5439 122.9961 143.9934 160.0274 168.4751 201.0249 244.8977 245.3520 329.1275 350.2159 357.1272 385.7644 402.2579 458.6866 499.8572 504.7743 565.1662 605.7032 661.9790 682.8753 706.9476 743.7396 771.7002 805.0681 809.0433 842.8463 890.0850 934.5565 981.7616 996.9519 1034.7436 1042.4423 1093.9259 1105.4539 1137.7145 1163.1811 1177.2843 1209.6977 1226.4745 1286.7108 1306.6104 1361.1666 1399.4637 1430.3132 1442.3738 1446.5768 1450.5458 1458.8200 1480.4565 1530.1339 1560.1372 1581.1653 1679.7833 3001.6499 3115.7440 3117.8062 3129.4930 3147.2114 3174.5390 3198.0603 3505.7870 3628.6232
redmass: 2.9938 5.4774 2.7936 1.5008 1.4686 2.3659 3.8375 4.6602 5.1527 8.9684 4.8079 5.5013 3.8310 6.3782 8.8851 7.2152 4.1573 3.5575 5.9270 5.2522 6.6818 6.7675 1.3111 1.4556 6.0067 2.3243 1.7698 6.6046 1.3092 5.9405 1.4053 3.4704 2.2178 2.3228 1.2403 1.4637 1.6298 1.2699 1.7840 2.4211 1.7313 2.7576 4.4861 3.8580 2.3257 1.4870 1.0539 2.1306 1.3007 4.2069 2.9452 6.4128 4.7899 7.5999 1.0280 1.1058 1.1049 1.0906 1.0912 1.0899 1.0994 1.0776 1.0666
irintensity: 8.6235 3.6557 37.6214 86.4944 31.9711 1.3979 5.8720 1.9926 9.5920 12.5195 6.8815 26.9519 2.9207 5.1130 2.6987 5.0967 2.1653 6.6286 14.4052 1.3966 0.0012 11.0790 159.3487 0.8685 13.1422 0.0252 28.9534 14.3224 2.4595 41.8877 2.0797 149.0404 93.8377 36.2694 0.1270 6.3910 21.9639 19.3471 214.7765 3.3689 109.0444 156.6265 12.2192 152.8251 312.9759 7.8463 9.8633 104.0491 16.2610 131.8635 76.8084 54.1136 36.3505 156.1100 86.8132 36.3359 31.8976 9.7067 0.3924 2.4653 7.4168 118.7435 53.5047
temp: 298.150 k
press: 1.00000 atm
elementType: 8 8 8 7 6 6 6 6 6 6 6 6 6 6 1 1 1 1 1 1 1 1 1
symmnumber: 1
zpe: 450248.3 jmol-1
zpe.correction: 0.171491 hartree
zpe.thermalcorrener: 0.183232 hartree
zpe.thermalcorrenthalpy: 0.184176 hartree
zpe.thermalcorrgfe: 0.134092 hartree
zpe.sumelectzpe: -665.851281 hartree
zpe.sumelectthermal: -665.839540 hartree
zpe.sumelectthermalent: -665.838595 hartree
zpe.sumelectthermalfe: -665.888679 hartree
dipole: -5.0878 2.7393 -0.0060
dipole: 5.7784
quadrupole: -62.9726 -73.8155 -84.5132
quadrupole: 4.3517 -0.0037 -0.0004
quadrupole: 10.7945 -0.0484 -10.7461 4.3517 -0.0037 -0.0004
hfenergy: -666.0227713 hartree
pointgroup: C01 [X(C10H9N1O3)]
dipole: 1.8625029 1.2581127 -0.3414627 debye
dipolederiv: -1.9116303 -0.256231 0.1605836 -0.1788471 -0.3205407 0.0160547 0.1494767 0.0222666 -0.3170364 -0.1603839 -0.4716568 0.057617 -0.1780934 -1.2876856 0.1552349 0.0095035 0.1771619 -0.452597 -0.6166752 -0.2631236 0.0640142 -0.6572499 -1.1267142 0.178675 0.1283509 0.1479255 -0.3690272 -0.6377039 0.1292476 0.0133011 -0.2764602 -0.6103414 0.0927197 0.0798662 0.0629523 -0.1859159 0.5756273 0.1970153 -0.0746943 -1.0535248 0.0797779 0.0649549 0.1307435 -0.0277146 -0.003192 -0.4550467 -0.3460327 0.0923901 0.9794975 -0.3094714 -0.0167585 -0.1248274 0.0811917 0.0264024 -0.6062636 0.1763569 0.0123619 0.7259173 1.1325595 -0.2475808 -0.078022 -0.2068418 -0.0107361 0.2406281 0.2197641 -0.0522981 0.8845274 1.0272712 -0.2308993 -0.1609363 -0.1802115 0.0584542 1.8090618 0.3874234 -0.1912158 -0.5342251 -0.4565191 0.1270248 -0.0406843 0.0590482 0.0722825 0.9805544 0.161572 -0.1012579 -0.2893125 0.1663307 -0.0111461 -0.0273912 -0.0444469 -0.0217226 0.2660848 0.0547042 -0.0417454 -0.0327112 0.0336119 -0.0322761 -0.027134 -0.0386613 -0.1685683 0.1143982 -0.123456 0.0091631 0.3797469 0.8095951 -0.1667129 -0.0733864 -0.129635 -0.0094395 -0.7671806 -0.3080144 0.0880271 -0.3704562 -0.3255429 0.0381405 0.0985568 0.0335841 -0.2721935 0.7818432 0.1435472 -0.0599056 0.4689356 0.3755942 -0.0478726 -0.1139808 -0.0240812 0.3005985 0.0628053 0.078115 -0.0049 0.1052635 -0.0401406 0.0268293 -0.009149 0.0288566 0.1666168 0.2418775 0.041299 -0.0007699 0.079961 0.2772265 0.0016538 -0.0072145 0.0044454 0.3230002 0.1064762 -0.0782333 0.0155518 -0.0019479 0.0381974 0.0173185 0.0029318 0.0228955 0.138603 -0.0457146 -0.0286209 0.0211503 -0.0428356 0.0933255 0.0169459 0.0234192 0.0158776 0.173064 -0.0044629 0.0793176 0.0010901 0.0863384 0.0188499 0.0211855 -0.0000915 0.0217511 0.1831025 0.1428631 0.1489093 -0.0051913 0.0579377 0.3773813 -0.0008674 0.0096186 -0.0078907 0.3993435 -0.2542647 0.0165322 0.0254318 0.1194466 0.0604262 -0.0012847 0.00878 0.0065953 0.1092809 0.0642472 0.0183704 -0.067749 -0.1321792 0.018459 0.0765396 -0.0065121 0.0600427 -0.0890245 0.0728593 0.0231945 0.0390452 -0.1397288 -0.0316506 -0.0778786 0.0280822 -0.0851117 -0.0512954 unknown
polarizability: 214.1494592|-0.7807114|149.4314276|-11.7016713|-15.6180274|57.192416 unknown
InChI: InChI=1S/C10H9NO3/c1-14-8-5-7(12)9-6(10(8)13)3-2-4-11-9/h2-5,11-12H,1H3
charge 0 multiplicity 1
23 atoms
O  -3.164556 0.42472 0.343416
O  0.825046 3.109367 -0.391726
O  -1.406959 -1.997863 0.609641
N  2.446153 0.90688 -0.150137
C  1.052165 0.761781 -0.023327
C  0.517173 -0.569196 0.234566
C  0.200435 1.854721 -0.139785
C  -0.943628 -0.806381 0.382018
C  -1.768799 0.399917 0.244327
C  1.421026 -1.634909 0.342812
C  -1.198541 1.661818 -0.00483
C  3.311499 -0.144012 -0.041693
C  2.826985 -1.434886 0.205918
C  -3.946148 -0.801653 0.602595
H  -1.887493 2.511461 -0.093536
H  2.779429 1.85978 -0.33093
H  1.000819 -2.628186 0.537179
H  4.375082 0.079307 -0.156716
H  3.530684 -2.264979 0.290297
H  0.155865 3.830776 -0.459464
H  -4.988931 -0.444262 0.626524
H  -3.66477 -1.260401 1.563365
H  -3.803134 -1.5448 -0.197515
