program: Gaussian 09
title: 000266908
version: EM64L-G09RevD.01
frameworkgroup: C1[X(C9H24N9O4P)]
method: RPBEPBE
basis: SDD
operation: Freq
keyword: #p
keyword: freq=noraman
keyword: PBEPBE/SDD
title: #p freq=noraman PBEPBE/SDD
converged: YES YES NO NO
title: Mulliken charges:
elementType: P O O O O N N N N N N N N N C C C C C C C C C H H H H H H H H H H H H H H H H H H H H H H H H
charge: 1.413754 -0.521767 -0.326893 -0.327354 -0.326618 -0.834857 -0.833934 -0.834467 -0.378777 -0.378593 -0.379045 -0.032688 -0.032747 -0.032722 0.433011 0.432916 0.433151 -0.594094 -0.595839 -0.594101 -0.596145 -0.593952 -0.595181 0.404854 0.404974 0.404485 0.282919 0.283170 0.282446 0.259873 0.226088 0.190308 0.190087 0.228945 0.249536 0.260134 0.225951 0.190437 0.228872 0.249566 0.190106 0.190180 0.259270 0.226292 0.228678 0.249543 0.190228
chargesum: 0.00000
title: Mulliken charges with hydrogens summed into heavy atoms:
elementType: P O O O O N N N N N N N N N C C C C C C C C C
charge: 1.413754 -0.521767 -0.326893 -0.327354 -0.326618 -0.430002 -0.428960 -0.429983 -0.095858 -0.095423 -0.096598 -0.032688 -0.032747 -0.032722 0.433011 0.432916 0.433151 0.082175 0.072729 0.082421 0.072399 0.081789 0.073268
polarizability: 2.39026016e+02 5.15183228e-02 2.38646959e+02 4.63704470e-02 -2.70873687e-02 1.62609989e+02
1716.lowfreq: -6.5453 -5.3431 -3.4593 -0.0016 -0.0009 -0.0005 17.9017 20.7639 23.4223
frequency: 17.7526 20.6222 23.3941 29.8243 31.0900 32.9445 59.8376 60.7287 76.7073 79.0536 79.7980 106.3487 106.8348 111.7658 129.2272 167.3281 169.1225 196.4434 205.8419 212.3897 213.3711 215.7267 219.2304 228.6709 236.3444 238.0190 259.1289 284.0528 285.0322 353.2631 353.6647 358.5220 380.5395 381.0256 392.4744 422.8377 429.9634 430.4604 445.8721 463.5831 463.7549 532.2792 532.9720 534.8672 682.6251 697.2788 697.4349 705.7658 713.4310 713.7591 736.1996 783.1733 783.7663 798.6663 808.0989 811.1628 857.3392 872.3754 872.9953 970.8171 971.0115 974.1297 1008.9279 1009.8813 1010.2029 1070.8176 1085.9322 1086.1054 1086.5933 1089.8644 1090.1317 1102.6783 1128.2436 1128.3873 1128.7392 1216.0359 1216.2401 1216.6540 1233.5206 1233.8049 1235.0272 1260.0298 1260.9291 1261.8353 1349.9568 1409.4285 1410.6159 1413.4808 1414.0020 1414.3347 1429.5486 1430.2174 1430.5060 1457.3832 1458.7599 1458.8170 1465.9866 1466.0670 1466.1983 1468.2490 1468.8843 1469.1150 1478.7258 1479.2373 1479.6809 1506.9057 1508.4200 1514.5940 1608.6917 1609.2088 1636.9196 2873.4499 2873.6783 2874.3979 2888.6815 2889.1935 2889.4660 3043.0494 3043.4412 3043.6088 3048.2014 3048.8307 3049.0828 3106.3409 3106.6417 3106.9361 3111.9753 3112.2262 3112.3128 3238.5979 3251.2693 3252.3704 3366.3687 3366.7275 3367.3134
redmass: 3.0215 3.7204 3.2539 3.7200 3.4873 3.4190 4.1837 4.0665 4.4825 6.4662 6.7977 5.6300 5.6370 6.0815 4.5552 3.7919 3.8521 2.9760 1.0402 1.1456 1.0519 1.3001 1.3637 1.3387 3.4311 2.9358 4.7427 5.0339 4.8933 4.0678 4.0574 4.3684 4.6140 4.6575 4.1483 1.9773 1.7894 1.7823 2.6217 3.6946 3.6362 1.6849 1.6813 1.6904 6.9730 5.4336 5.3822 7.4246 6.1923 6.4035 4.0054 3.4226 3.5146 1.4444 1.5800 1.5062 5.4932 5.6791 5.6664 4.1161 4.1118 4.4322 1.6221 1.6260 1.6231 7.4412 1.2771 1.3059 1.2604 2.0766 2.1654 2.5584 1.4297 1.4290 1.4272 1.5460 1.8996 1.7446 3.8613 3.8403 3.8487 2.8302 2.8299 2.8035 2.3994 1.4805 1.4663 1.1420 1.1456 1.1403 1.1975 1.2462 1.2400 1.0514 1.0527 1.0531 1.0565 1.0581 1.0544 1.0948 1.1022 1.1126 1.0540 1.0541 1.0543 1.6134 1.6124 1.7130 6.8188 6.7891 4.2166 1.0559 1.0558 1.0557 1.0545 1.0544 1.0545 1.0745 1.0746 1.0747 1.0765 1.0763 1.0766 1.1012 1.1012 1.1011 1.1017 1.1017 1.1018 1.0779 1.0826 1.0826 1.0758 1.0758 1.0758
irintensity: 2.3047 2.8540 0.1906 1.6305 1.9368 2.1195 1.0481 1.0654 0.6885 3.1513 3.3472 0.2056 0.3535 7.5493 3.5512 16.6008 16.5006 1.3167 0.1315 2.9055 0.2369 5.6212 6.4549 1.2827 12.5347 11.3243 2.1288 2.2675 2.2655 7.3288 7.6015 1.5125 30.5203 30.8358 3.2817 17.2191 10.6231 9.7906 9.0134 18.8221 17.9520 48.9659 76.6974 83.8285 1.2763 73.8162 74.2559 0.5253 3.9103 4.0329 18.6880 91.2754 97.9284 330.6266 64.1505 59.0546 0.4275 0.2433 0.2789 4.2435 4.3314 0.3628 14.0382 13.0038 20.8959 146.0271 4.5470 9.6225 13.9997 90.7260 94.3593 78.5003 31.6536 27.0015 7.7578 42.7821 137.1113 100.0044 4.1454 6.6993 7.3634 50.0016 54.9160 6.9341 71.8634 976.2534 956.4738 9.9064 20.2097 5.0740 21.3307 268.8734 244.2645 20.5044 25.7884 18.3512 10.2589 12.1536 9.4721 34.0901 46.4779 86.6930 9.8399 10.2536 10.5385 270.4249 266.6890 45.2995 211.6405 212.8429 3.2834 74.3616 78.1667 73.0449 204.9307 231.1689 58.8496 19.3097 16.5239 18.7881 43.5981 42.5371 40.4356 15.6014 15.3606 14.8457 35.9749 37.0845 23.4216 12.1927 604.1061 607.1071 63.9238 56.6675 32.7462
temp: 298.150 k
press: 1.00000 atm
elementType: 15 8 8 8 8 7 7 7 7 7 7 7 7 7 6 6 6 6 6 6 6 6 6 1 1 1 1 1 1 1 1 1 1 1 1 1 1 1 1 1 1 1 1 1 1 1 1
symmnumber: 1
zpe: 980647.3 jmol-1
zpe.correction: 0.373509 hartree
zpe.thermalcorrener: 0.402206 hartree
zpe.thermalcorrenthalpy: 0.403150 hartree
zpe.thermalcorrgfe: 0.309959 hartree
zpe.sumelectzpe: -1490.327042 hartree
zpe.sumelectthermal: -1490.298345 hartree
zpe.sumelectthermalent: -1490.297401 hartree
zpe.sumelectthermalfe: -1490.390592 hartree
dipole: -0.0195 0.0086 4.8879
dipole: 4.8879
quadrupole: -114.6528 -115.0047 -155.8355
quadrupole: -0.0270 0.0293 0.1941
quadrupole: 13.8449 13.4929 -27.3378 -0.0270 0.0293 0.1941
hfenergy: -1490.7005508 hartree
pointgroup: C01 [X(C9H24N9O4P1)]
dipole: -0.046272 -0.2112054 -1.9108638 debye
polarizability: 238.8403363|-0.3641607|237.8720877|-1.5282183|-8.3586193|163.5705407 unknown
InChI: InChI=1S/C9H24N9O4P/c1-16(2)10-7(19)13-23(22,14-8(20)11-17(3)4)15-9(21)12-18(5)6/h10-15H,1-6H3
charge 0 multiplicity 1
47 atoms
P  0.050892 0.175356 1.113875
O  0.086944 0.359362 2.68897
O  2.815564 0.881151 -0.100071
O  -2.095497 2.040265 -0.125671
O  -0.638128 -2.762391 0.39429
N  1.312379 -0.844674 0.426281
N  0.202751 1.65082 0.16194
N  -1.41446 -0.546557 0.451906
N  3.483878 -1.380216 -0.21111
N  -0.509118 3.689175 -0.70371
N  -2.915099 -2.267972 0.013591
N  4.76281 -1.101517 -0.740276
N  -1.457699 4.577038 -1.255774
N  -3.27758 -3.596129 -0.297644
C  2.565341 -0.36139 0.027023
C  -0.889718 2.440836 -0.218905
C  -1.594375 -1.926958 0.293427
C  5.823605 -1.143798 0.291714
C  5.038763 -1.894791 -1.955252
C  -1.838453 5.656675 -0.31704
C  -1.065772 5.027661 -2.606322
C  -3.959578 -4.273558 0.828129
C  -3.972887 -3.686124 -1.597971
H  0.996693 -1.831614 0.324915
H  1.191417 1.836334 -0.106287
H  -2.102926 0.178759 0.161885
H  3.261205 -2.334852 0.111342
H  0.459847 4.008143 -0.548449
H  -3.649437 -1.553462 0.136339
H  5.558889 -0.449636 1.104804
H  6.770547 -0.803464 -0.161807
H  5.983056 -2.163111 0.720702
H  5.116628 -2.993669 -1.761616
H  5.99472 -1.55371 -2.388746
H  4.23828 -1.72137 -2.692122
H  -2.199517 5.203514 0.61963
H  -2.664384 6.236684 -0.763737
H  -1.000004 6.357222 -0.083013
H  -1.89133 5.623353 -3.032659
H  -0.900151 4.14821 -3.249067
H  -0.141562 5.657636 -2.614932
H  -4.954171 -3.828202 1.075365
H  -3.313569 -4.224336 1.718813
H  -4.108085 -5.334759 0.563734
H  -4.129042 -4.751276 -1.841308
H  -3.339424 -3.237461 -2.379801
H  -4.968643 -3.176997 -1.606288
