program: Gaussian 09
title: 000266907
version: EM64L-G09RevD.01
frameworkgroup: C1[X(C3H12N9O4P)]
method: RPBEPBE
basis: SDD
operation: Freq
keyword: #p
keyword: freq=noraman
keyword: PBEPBE/SDD
title: #p freq=noraman PBEPBE/SDD
converged: NO YES NO NO
title: Mulliken charges:
elementType: P O O O O N N N N N N N N N C C C H H H H H H H H H H H H
charge: 1.410158 -0.510618 -0.358317 -0.358179 -0.358279 -0.813018 -0.813890 -0.813407 -0.382702 -0.382851 -0.382836 -0.500956 -0.500886 -0.500921 0.398154 0.398237 0.398200 0.408985 0.409095 0.408940 0.331677 0.331724 0.331805 0.304981 0.311682 0.311551 0.305008 0.305037 0.311624
chargesum: 0.00000
title: Mulliken charges with hydrogens summed into heavy atoms:
elementType: P O O O O N N N N N N N N N C C C
charge: 1.410158 -0.510618 -0.358317 -0.358179 -0.358279 -0.404034 -0.404795 -0.404467 -0.051025 -0.051128 -0.051031 0.115707 0.115674 0.115741 0.398154 0.398237 0.398200
polarizability: 1.60377468e+02 -1.30657109e-02 1.60330472e+02 -4.56396616e-02 -5.44386688e-02 9.73594554e+01
1716.lowfreq: -5.8661 -0.0015 -0.0008 -0.0003 0.7201 3.2881 38.0327 41.2443 42.6182
frequency: 38.0162 41.2256 42.6115 69.8139 70.3529 93.4193 105.1926 107.7828 159.3314 161.2699 161.5763 185.3791 197.5060 204.0660 211.4377 216.1181 218.4983 254.7242 293.8793 294.0327 330.2125 330.4239 348.5508 421.2834 445.8517 446.3478 530.8471 534.4036 535.3738 681.5671 706.3946 707.0165 716.8531 724.5353 724.9971 741.2185 742.8587 745.1181 772.1341 792.4533 799.8107 802.9083 826.1168 826.4111 988.1216 988.3716 992.2533 1077.2652 1175.9745 1178.6124 1179.2470 1261.2612 1267.9018 1268.5108 1286.5510 1287.2291 1287.6417 1358.8265 1413.3795 1414.8804 1465.2469 1465.4544 1476.2103 1589.2256 1589.4021 1618.9048 1681.8620 1682.0944 1682.7159 3250.3486 3262.6191 3266.2101 3408.5694 3408.6386 3408.7389 3528.2009 3528.3231 3528.3658 3555.1900 3555.3832 3555.7119
redmass: 6.1821 5.7889 5.8168 6.0008 5.9884 3.5171 5.2748 5.3716 4.9767 4.4587 4.5361 3.7442 1.2097 1.3178 1.4252 4.1394 4.0764 7.8641 6.7419 6.7068 6.2726 6.2617 5.6801 5.7897 8.1639 8.2102 1.1641 1.1455 1.1450 4.7507 4.1080 4.0771 4.8142 5.3013 5.6975 1.7997 1.7898 2.3334 2.4995 1.4349 1.4616 1.4893 3.8271 4.0975 5.4350 5.4344 6.6247 13.3144 2.1440 2.8457 2.8759 1.9542 2.0736 2.0671 1.1675 1.1668 1.1659 1.9794 1.4590 1.4537 2.2363 2.2371 2.3475 6.0015 6.0023 3.7718 1.0632 1.0643 1.0659 1.0781 1.0825 1.0825 1.0426 1.0425 1.0426 1.1002 1.1002 1.1002 1.0794 1.0794 1.0794
irintensity: 1.0544 1.5264 1.4280 2.0326 1.7069 0.6219 3.2086 3.1478 2.3152 1.0197 1.0776 4.4234 11.3338 9.5734 38.5068 5.3927 2.1334 3.6183 15.4108 16.7703 79.4004 79.8025 15.3112 0.1037 34.6828 34.5268 373.8974 12.0886 17.5508 0.2250 20.4947 20.2809 15.5462 11.4439 9.5190 198.5569 194.4952 74.8921 3.2543 375.9846 48.2908 39.6470 146.8543 153.3726 25.9161 25.8021 0.0846 232.6386 1.9214 22.1207 22.1368 0.4252 39.9237 39.4980 0.8699 0.8981 0.7049 42.5991 652.5592 648.1073 816.0414 822.3471 92.7902 163.9985 164.6950 2.6888 36.8559 26.4432 11.4723 30.9923 522.5561 520.8663 0.4623 0.4003 0.3880 3.0754 3.1018 3.2585 63.9907 57.1391 17.2723
temp: 298.150 k
press: 1.00000 atm
elementType: 15 8 8 8 8 7 7 7 7 7 7 7 7 7 6 6 6 1 1 1 1 1 1 1 1 1 1 1 1
symmnumber: 1
zpe: 558018.2 jmol-1
zpe.correction: 0.212538 hartree
zpe.thermalcorrener: 0.232528 hartree
zpe.thermalcorrenthalpy: 0.233472 hartree
zpe.thermalcorrgfe: 0.163123 hartree
zpe.sumelectzpe: -1255.038900 hartree
zpe.sumelectthermal: -1255.018910 hartree
zpe.sumelectthermalent: -1255.017966 hartree
zpe.sumelectthermalfe: -1255.088315 hartree
dipole: -0.0006 0.0203 -4.6438
dipole: 4.6439
quadrupole: -98.7681 -98.7117 -115.9179
quadrupole: 0.0023 0.0699 0.0651
quadrupole: 5.6978 5.7542 -11.4520 0.0023 0.0699 0.0651
hfenergy: -1255.251438 hartree
pointgroup: C01 [X(C3H12N9O4P1)]
dipole: -0.0902445 -0.2077913 -1.812932 debye
polarizability: 160.2054133|-0.3256435|159.5898825|-2.7807985|-6.9956467|98.2720999 unknown
InChI: InChI=1S/C3H12N9O4P/c4-7-1(13)10-17(16,11-2(14)8-5)12-3(15)9-6/h7-12H,4-6H2
charge 0 multiplicity 1
29 atoms
P  -0.012978 0.053507 0.778645
O  0.066672 0.231063 2.351759
O  0.947232 -2.788413 -0.00527
O  1.796235 2.159242 -0.593488
O  -2.934731 0.439702 -0.192585
N  1.465764 -0.493527 -0.013413
N  -0.417533 1.501071 -0.144797
N  -1.203255 -1.107846 0.189765
N  3.090545 -2.079567 -0.604107
N  0.026914 3.597394 -1.100181
N  -3.367602 -1.851561 -0.324856
N  3.565373 -3.383104 -0.87652
N  0.854962 4.601112 -1.652805
N  -4.724584 -1.686747 -0.685807
C  1.786018 -1.838808 -0.191099
C  0.539592 2.404571 -0.605355
C  -2.523016 -0.76989 -0.107528
H  2.059295 0.303551 -0.320791
H  -1.44257 1.588748 -0.302062
H  -0.797835 -2.060535 0.085771
H  3.790467 -1.337139 -0.624478
H  -0.958879 3.839988 -0.996002
H  -3.071187 -2.808525 -0.130321
H  3.116107 -3.775728 -1.71409
H  3.440597 -4.00052 -0.062941
H  1.568586 4.906483 -0.977451
H  1.285295 4.286495 -2.532215
H  -4.813285 -1.288931 -1.629939
H  -5.225796 -1.115282 0.007662
