program: Gaussian 09
title: 000266902
version: EM64L-G09RevD.01
frameworkgroup: C1[X(C24H26ClNO6S2)]
method: RPBEPBE
basis: SDD
operation: Freq
keyword: #p
keyword: freq=noraman
keyword: PBEPBE/SDD
title: #p freq=noraman PBEPBE/SDD
converged: NO NO NO NO
title: Mulliken charges:
elementType: Cl S S O O O O O O N C C C C C C C C C C C C C C C C C C C C C C C C H H H H H H H H H H H H H H H H H H H H H H H H H H
charge: -0.080348 0.972697 0.987047 -0.394876 -0.430606 -0.499533 -0.522277 -0.495984 -0.516523 -0.170659 -0.425186 -0.443330 0.467009 -0.253408 -0.250221 -0.308545 -0.363090 -0.060488 -0.045928 -0.114095 -0.209463 -0.310462 -0.190425 -0.227863 -0.245040 -0.250520 0.453031 0.453150 -0.324719 -0.389897 -0.397873 -0.327820 -0.798762 -0.796555 0.278162 0.238977 0.257167 0.240057 0.232355 0.226574 0.245754 0.241392 0.258496 0.254447 0.226258 0.255208 0.284053 0.281468 0.289334 0.287930 0.250969 0.248879 0.246793 0.247137 0.239610 0.228366 0.240924 0.240000 0.239863 0.231390
chargesum: 0.00000
title: Mulliken charges with hydrogens summed into heavy atoms:
elementType: Cl S S O O O O O O N C C C C C C C C C C C C C C C C C C C C C C C C
charge: -0.080348 0.972697 0.987047 -0.394876 -0.430606 -0.499533 -0.522277 -0.495984 -0.516523 -0.170659 0.091953 0.053894 0.467009 0.205521 0.236925 -0.050049 -0.108643 -0.060488 -0.045928 -0.114095 0.016795 -0.055254 0.093628 0.053605 0.044294 0.037410 0.453031 0.453150 -0.073751 -0.141018 -0.151080 -0.080683 -0.089861 -0.085303
polarizability: 5.11680365e+02 -5.82568833e+01 3.80439693e+02 -5.37625710e+00 -1.84425454e+01 2.62611051e+02
1716.lowfreq: -9.0328 -0.0022 -0.0015 -0.0007 4.3910 5.8686 10.6086 11.6269 14.7964
frequency: 1.1832 10.5046 14.4949 16.1168 18.8812 28.5794 30.5598 34.3625 38.8050 41.3495 46.1340 48.7136 62.4350 77.5529 90.8734 106.5720 124.2162 127.4389 133.1394 142.8224 147.4126 165.2650 180.3924 188.2177 212.1438 214.7918 228.4191 230.0456 243.2861 254.4573 262.3563 290.2645 296.0021 312.7617 319.4987 332.4023 352.8900 361.1423 369.5543 385.9386 386.9667 403.8877 407.6359 408.2541 411.4124 428.9331 446.3675 463.2146 467.9379 477.8475 501.2047 514.0600 531.3425 549.9990 561.9264 584.1386 592.5280 593.2631 620.6001 621.1461 658.0923 677.6007 702.7974 705.3719 743.9295 760.9062 777.6533 778.3678 813.2763 817.9096 819.5740 823.2065 825.5545 828.3595 831.1181 842.7590 848.6691 857.4239 893.5106 919.3504 945.4363 952.4773 957.0486 962.1132 964.0992 966.1072 970.0512 981.9525 984.5249 986.5869 988.1390 996.4998 997.1797 1001.8791 1013.6308 1050.2151 1050.4902 1050.8515 1054.3893 1061.3278 1076.6333 1097.9388 1106.9974 1120.7157 1120.7462 1174.7004 1185.4597 1186.5570 1187.6914 1202.9162 1218.6806 1218.9219 1233.0378 1248.1451 1274.3462 1297.5563 1298.6767 1304.2554 1341.1779 1343.4370 1352.7514 1363.3014 1371.0913 1380.1428 1381.3041 1392.6069 1392.8911 1395.0963 1401.5549 1403.2396 1438.2095 1444.3550 1468.1430 1469.5831 1470.5276 1470.6527 1471.8817 1472.4427 1475.4638 1476.2226 1477.5547 1493.5384 1555.4506 1591.6593 1592.8747 1594.2813 1594.8239 1614.0835 2964.0219 2973.2594 2974.9631 2982.8867 2984.2730 3017.3403 3038.6764 3055.1005 3062.2955 3063.3373 3074.9700 3087.3167 3093.0851 3095.6930 3138.3458 3138.5568 3141.7221 3143.3969 3144.1858 3164.9190 3167.7067 3168.3308 3178.0866 3178.9585 3182.4503 3186.7154
redmass: 6.8812 6.2679 6.7946 6.4538 6.1420 4.9731 5.9762 4.6792 1.3078 2.3395 1.4864 3.2534 4.6411 5.6794 5.2110 5.3683 6.8858 5.5693 7.3534 3.9154 4.8702 5.9617 6.4757 5.3183 5.3596 5.9777 7.6433 8.1926 4.3099 4.6619 7.2921 5.1240 5.3904 4.3672 4.6144 3.3781 4.2967 5.6439 5.7393 4.0546 4.5527 4.8873 2.9237 2.8800 3.1812 3.8151 3.7755 7.6565 5.8823 3.3098 3.1831 3.7244 3.5639 3.1322 4.3991 3.9585 6.2440 5.9672 6.9612 6.9575 6.1823 2.1043 3.3135 3.3422 4.1740 1.4002 4.9461 4.9809 3.2322 4.3143 3.0461 4.1918 1.7460 1.6631 1.6264 1.2510 1.2469 1.4076 3.2090 2.3616 14.4491 10.8039 1.4079 1.3031 1.3171 3.3417 3.8640 1.4444 1.3845 2.1764 2.1706 2.2071 2.3749 2.8978 2.8847 1.6010 1.5920 2.4210 2.5042 2.1386 2.1476 1.6934 2.1797 1.2874 1.2889 2.2811 1.1410 1.1354 1.1268 1.1760 3.0512 3.0207 1.3207 1.2168 1.2956 1.2659 1.2603 1.3386 1.2350 1.2628 1.2943 1.2822 4.0963 4.6341 4.2204 3.1305 3.0455 1.9638 1.3228 1.3018 2.4377 1.1291 1.1187 1.0462 1.0554 2.3061 1.1549 2.3216 1.1099 1.1091 1.1602 2.4929 6.4574 6.5083 6.6953 6.2532 6.1286 6.7562 1.0638 1.0629 1.0576 1.0376 1.0378 1.0621 1.1038 1.1049 1.0972 1.0974 1.1023 1.0934 1.0991 1.0989 1.0894 1.0883 1.0894 1.0893 1.0903 1.0957 1.0960 1.0971 1.0922 1.0957 1.0916 1.0959
irintensity: 1.4959 2.1965 0.9759 0.3192 0.1021 0.0169 0.1240 0.2916 1.2962 1.3614 0.6280 0.4968 0.1801 2.2432 1.1707 0.2648 6.3221 3.3754 1.9191 2.5238 1.9950 5.9595 0.2790 6.6485 6.7919 4.1163 11.3812 9.1001 10.5555 7.9073 2.3285 3.2399 6.2256 3.2736 2.4491 6.9239 9.5215 7.3864 9.5205 3.8486 6.9466 16.0106 0.0395 0.0476 10.5745 10.7839 26.3657 11.1714 107.8861 2.9837 32.0469 108.5165 41.2450 26.1555 14.4836 31.7450 77.1031 16.1390 0.3830 0.2467 11.2168 28.3273 1.1117 1.1266 25.2601 69.5052 6.0099 4.4921 10.9339 52.1673 67.2802 129.8882 32.9335 5.9765 29.1572 3.7283 0.4802 0.5661 69.4020 13.6056 74.1849 69.1838 3.5701 1.8321 3.1083 43.8354 37.7207 0.2666 0.1624 3.1410 2.9231 1.1558 10.8607 22.5142 132.3581 12.2712 16.5192 20.5907 31.6079 9.0286 16.1102 14.8171 23.2308 7.1447 6.7593 66.3803 2.7512 11.9287 6.1974 25.8287 8.5953 5.2784 22.2490 27.8362 15.7253 2.3065 2.9386 4.8213 6.5219 59.8586 11.5650 30.2507 17.4647 3.7751 4.7643 11.9566 11.2728 30.7234 16.3048 17.0413 2.5719 9.4958 43.0365 14.7295 16.8296 9.1121 15.7544 26.0989 14.8113 16.9494 29.7867 193.9235 87.9558 10.9267 5.2774 11.0999 9.7540 293.8929 4.2919 54.3787 41.3845 20.8523 20.9881 16.3971 21.2999 17.5537 14.2241 14.7745 16.0297 12.3511 18.8309 15.6401 10.0085 13.6040 13.4875 7.6083 3.3702 1.3187 5.5443 8.9167 2.8793 2.5145 6.9636 2.3069
temp: 298.150 k
press: 1.00000 atm
elementType: 17 16 16 8 8 8 8 8 8 7 6 6 6 6 6 6 6 6 6 6 6 6 6 6 6 6 6 6 6 6 6 6 6 6 1 1 1 1 1 1 1 1 1 1 1 1 1 1 1 1 1 1 1 1 1 1 1 1 1 1
symmnumber: 1
zpe: 1184422.5 jmol-1
zpe.correction: 0.451123 hartree
zpe.thermalcorrener: 0.487244 hartree
zpe.thermalcorrenthalpy: 0.488189 hartree
zpe.thermalcorrgfe: 0.372313 hartree
zpe.sumelectzpe: -2689.572985 hartree
zpe.sumelectthermal: -2689.536863 hartree
zpe.sumelectthermalent: -2689.535919 hartree
zpe.sumelectthermalfe: -2689.651795 hartree
dipole: -0.3336 -4.2237 2.7663
dipole: 5.0600
quadrupole: -157.4226 -256.3111 -222.1748
quadrupole: -31.9194 5.0199 -5.1390
quadrupole: 54.5469 -44.3416 -10.2053 -31.9194 5.0199 -5.1390
hfenergy: -2690.0241077 hartree
pointgroup: C01 [X(C24H26Cl1N1O6S2)]
dipole: -0.410619 -1.566241 -1.1582064 debye
polarizability: 470.4361111|7.0318548|285.2248936|-90.347258|48.4615384|399.0701039 unknown
InChI: InChI=1S/C24H26ClNO6S2/c1-19-6-10-23(11-7-19)33(27,28)31-16-14-26(22-5-3-4-21(25)18-22)15-17-32-34(29,30)24-12-8-20(2)9-13-24/h3-13,18H,14-17H2,1-2H3
charge 0 multiplicity 1
60 atoms
Cl -2.129437 2.166252 5.292729
S  -2.717656 -0.299922 -1.949816
S  4.673296 1.393748 0.685087
O  -1.631619 -1.567573 -1.036753
O  2.890411 0.744712 0.574364
O  -3.231723 -0.944212 -3.3441
O  -1.872088 1.093634 -1.961898
O  5.427182 0.7469 1.964617
O  4.573529 3.007663 0.507826
N  -0.034777 0.014697 0.986183
C  0.455176 -1.143648 0.221278
C  0.538865 1.313097 0.616205
C  -0.885356 -0.128586 2.097257
C  -0.187423 -1.300866 -1.170839
C  1.91305 1.618676 1.26234
C  -1.060586 0.939534 3.037433
C  -1.619054 -1.338134 2.321647
C  -4.149033 -0.215435 -0.753256
C  5.306542 0.598116 -0.883287
C  -1.932347 0.766063 4.124614
C  -2.462605 -1.473156 3.438639
C  -2.642351 -0.421879 4.370829
C  -4.017219 0.56953 0.404092
C  5.10535 1.270543 -2.09847
C  -5.309447 -0.933438 -1.080945
C  5.974388 -0.633226 -0.773366
C  -6.319673 -0.080361 1.003569
C  6.285482 -0.583787 -3.221651
C  -5.119216 0.630139 1.280519
C  5.60777 0.663074 -3.270997
C  -6.399146 -0.852865 -0.184565
C  6.463887 -1.216746 -1.960782
C  -7.488305 -0.010303 1.968537
C  6.818607 -1.231909 -4.485571
H  1.547636 -1.016682 0.06853
H  0.317649 -2.064589 0.808607
H  0.658493 1.360741 -0.480932
H  -0.165004 2.121998 0.878463
H  -0.026873 -0.376455 -1.762876
H  0.262287 -2.155104 -1.71215
H  2.182863 2.680282 1.088314
H  1.908428 1.400526 2.34613
H  -0.513679 1.879953 2.947535
H  -1.576511 -2.147431 1.590016
H  -3.012879 -2.410271 3.578586
H  -3.299552 -0.523022 5.237527
H  -3.096171 1.118201 0.616564
H  4.596557 2.239095 -2.127573
H  -5.360397 -1.519033 -2.004021
H  6.117612 -1.102879 0.204885
H  -5.03833 1.228723 2.1946
H  5.47031 1.166063 -4.234374
H  -7.320292 -1.399902 -0.413549
H  6.992852 -2.175228 -1.907369
H  -7.796297 1.036273 2.147893
H  -8.364995 -0.562579 1.590818
H  -7.216028 -0.438917 2.951311
H  7.909182 -1.400927 -4.417341
H  6.348075 -2.218213 -4.656005
H  6.627888 -0.609458 -5.375457
