program: Gaussian 09
title: 000266901
version: EM64L-G09RevD.01
frameworkgroup: C1[X(C10H10N2O2)]
method: RPBEPBE
basis: SDD
operation: Freq
keyword: #p
keyword: freq=noraman
keyword: PBEPBE/SDD
title: #p freq=noraman PBEPBE/SDD
converged: NO NO NO NO
title: Mulliken charges:
elementType: O O N N C C C C C C C C C C H H H H H H H H H H
charge: -0.255885 -0.283610 -0.260957 -0.080278 0.161329 0.409178 -0.331451 -0.294986 0.296114 -0.268322 -0.479554 0.195556 -0.804414 -0.510178 0.307735 0.265815 0.248342 0.268005 0.239060 0.236509 0.236508 0.236660 0.236662 0.232163
chargesum: 0.00000
title: Mulliken charges with hydrogens summed into heavy atoms:
elementType: O O N N C C C C C C C C C C
charge: -0.255885 -0.283610 -0.260957 -0.080278 0.161329 0.409178 -0.023716 -0.029172 0.296114 -0.019979 -0.211549 0.195556 -0.092338 0.195307
polarizability: 2.11739144e+02 3.35261573e+00 1.43070597e+02 -5.02429599e-04 2.31977489e-04 5.99201053e+01
1716.lowfreq: -6.5623 -0.0011 -0.0005 -0.0002 8.7553 9.2453 65.7284 100.5231 115.2771
frequency: 65.7263 100.5228 115.2757 137.0548 158.5649 167.3387 201.5277 213.6022 240.2998 353.5812 354.1922 384.7843 404.3745 427.7495 502.2655 535.9733 545.8474 596.0388 614.1885 671.0561 675.5896 701.5596 753.2027 821.8262 830.5904 840.3145 868.2370 907.4745 927.6096 988.0792 996.0555 1001.4264 1038.4518 1054.9849 1110.3502 1127.5027 1149.9643 1173.9536 1206.6436 1232.1480 1254.7168 1304.5429 1323.8431 1372.1567 1406.0731 1419.5073 1450.2932 1455.0855 1464.2524 1469.5383 1473.0230 1498.7984 1519.4574 1551.2246 1643.6701 1679.6404 2980.4914 3000.9791 3057.6185 3096.2579 3102.9040 3140.3317 3141.3035 3165.8829 3188.7503 3207.4484
redmass: 3.7978 2.8835 1.0907 1.2502 3.3762 3.4353 5.3093 4.2545 3.6919 4.6366 6.2556 4.1658 5.7498 3.9015 6.3076 8.8375 2.7899 5.3239 5.5263 3.4790 11.0160 6.0041 4.3296 1.5756 5.2166 1.4621 6.4514 8.1387 1.3071 1.3196 1.8802 3.4758 2.2511 1.5116 1.2508 1.5685 1.4383 1.8945 3.7595 3.8191 1.6531 2.4873 2.8054 2.6755 1.2519 1.6536 1.0518 2.7658 1.0639 1.0447 1.1720 3.8735 5.0372 7.2433 6.4929 9.7668 1.0377 1.0292 1.0979 1.0986 1.1044 1.1048 1.0908 1.0930 1.0959 1.0923
irintensity: 2.6578 0.8588 0.2565 0.0299 0.0231 3.3310 7.8930 3.7454 0.5108 4.5913 0.1797 1.1292 19.4334 0.6864 6.6143 0.3803 15.6833 9.3562 3.8505 0.5354 0.0917 4.3636 0.3171 46.8143 8.6035 48.9121 10.7857 0.7884 7.8048 2.1880 21.8198 30.3730 10.9075 12.9213 0.2082 18.6247 1.8233 4.7816 329.9581 6.1812 3.0866 16.7545 39.3973 41.1155 4.1642 86.4208 13.2217 351.9591 49.3021 15.1374 14.4828 67.3832 247.2986 15.5253 86.7449 492.1576 33.9592 53.2314 17.4548 13.2458 30.7554 28.2710 7.8633 12.7288 3.1306 0.1557
temp: 298.150 k
press: 1.00000 atm
elementType: 8 8 7 7 6 6 6 6 6 6 6 6 6 6 1 1 1 1 1 1 1 1 1 1
symmnumber: 1
zpe: 481878.1 jmol-1
zpe.correction: 0.183538 hartree
zpe.thermalcorrener: 0.195893 hartree
zpe.thermalcorrenthalpy: 0.196837 hartree
zpe.thermalcorrgfe: 0.145061 hartree
zpe.sumelectzpe: -646.014177 hartree
zpe.sumelectthermal: -646.001822 hartree
zpe.sumelectthermalent: -646.000878 hartree
zpe.sumelectthermalfe: -646.052654 hartree
dipole: -2.3539 -4.9946 -0.0001
dipole: 5.5215
quadrupole: -63.3641 -88.0148 -83.3506
quadrupole: -0.3193 0.0004 -0.0008
quadrupole: 14.8791 -9.7716 -5.1075 -0.3193 0.0004 -0.0008
hfenergy: -646.1977148 hartree
pointgroup: C01 [X(C10H10N2O2)]
dipole: -1.0369659 1.9088439 0.0005759 debye
dipolederiv: -1.7459435 -0.6121373 -0.0001298 -0.4769741 -0.6084833 -0.0000679 -0.0000507 -0.0000327 -0.3112139 -0.5248161 -0.471194 -0.0001108 -0.1966566 -1.3066021 -0.0002139 -0.0001033 -0.0004003 -0.3638332 -0.4704346 0.324446 0.0001008 -0.3184943 -0.633295 -0.0001998 -0.0001114 -0.0001578 0.024395 -1.7692367 0.3333416 0.0001006 0.4096988 -0.5908968 -0.0001034 0.0001351 -0.0001166 -0.2386395 1.4256227 -0.1291546 -0.0000306 0.1707931 0.0913287 -0.0000003 0.0000356 0.0000012 0.122344 0.4541685 0.1476552 0.0000397 -0.2947001 -0.1332267 -0.0000185 -0.0000573 -0.0000121 -0.0582365 -0.0960348 -0.2241016 -0.0000682 0.2470682 0.0130435 0.0000048 0.0000478 0.0000188 -0.0557392 -0.4704747 0.037972 0.0000129 0.2457411 0.0386935 0.0000517 0.0000717 0.0000503 -0.1623877 0.701353 0.5891422 0.0001403 0.0768733 1.7266952 0.0004117 0.0001057 0.0005151 0.1633211 0.1635329 -0.0738636 -0.0000179 0.129711 0.1849519 0.0000756 0.0000329 0.0000749 -0.1121738 -0.5409669 -0.657852 -0.0001913 -0.2421202 -0.6311649 -0.0000793 -0.0000887 -0.0000656 -0.2610976 2.1782 0.3860778 0.0000566 -0.1578934 1.0791494 0.000216 -0.0001118 0.0002259 0.189888 -0.1182248 -0.0171928 -0.0000049 0.0559985 0.0496431 -0.0000042 0.0000028 -0.0000062 0.0654723 0.5475624 0.1948181 0.0000459 0.5127379 0.5491564 0.0000648 0.0001161 0.000069 0.2784302 0.1237097 0.0004473 -0.0000005 -0.0854316 0.1005626 -0.0000144 -0.0000227 -0.0000187 0.1736936 0.0669805 -0.065378 -0.0000171 -0.0221383 -0.0040834 -0.0000435 -0.0000046 -0.0000418 0.164125 0.0125127 0.1065949 0.0000276 0.0976371 -0.0019412 -0.000038 0.0000207 -0.0000382 0.1477169 0.059051 0.0376081 0.0000217 0.0566411 0.0414146 -0.0000429 0.0000355 -0.0000558 0.1957741 0.0721413 0.0195884 0.0000051 -0.0977128 -0.1067471 -0.0000496 -0.0000211 -0.0000518 0.1155785 -0.028866 0.0197386 -0.059086 0.0364167 0.0698323 0.0938825 -0.1225299 0.0711712 -0.0346596 -0.0288632 0.0197122 0.059096 0.0363618 0.0699063 -0.0938363 0.1225499 -0.0711235 -0.0347346 0.0877885 0.0359213 0.0794667 -0.1029016 -0.0379719 -0.0658699 0.033144 -0.0910132 -0.0651064 0.0877815 0.0359833 -0.0794673 -0.1028643 -0.0380571 0.0658904 -0.0332243 0.0910197 -0.0649962 -0.1865433 -0.038173 0.0000104 0.0222087 0.0780919 -0.0000157 0.0000283 -0.0000118 0.1220795 unknown
polarizability: 211.8973926|0.590185|142.9123431|-0.0013276|0.0224254|59.9201114 unknown
InChI: InChI=1S/C10H10N2O2/c1-7-3-4-8-11-9(14-2)5-10(13)12(8)6-7/h3-6H,1-2H3
charge 0 multiplicity 1
24 atoms
O  3.492348 0.206169 -0.000178
O  -0.216065 -2.851801 -0.001012
N  -0.570598 -0.49729 -0.000255
N  1.290744 1.055283 0.000143
C  -0.0417 0.809308 0.000083
C  -2.865989 0.29586 -0.000053
C  -1.938602 -0.737775 -0.000313
C  -0.987897 1.887671 0.000354
C  0.332129 -1.711128 -0.000514
C  -2.35577 1.642688 0.000289
C  1.71539 -1.368108 -0.000523
C  2.128913 -0.024014 -0.000172
C  -4.354865 0.020974 -0.000121
C  3.945771 1.613558 0.000179
H  -2.193128 -1.801796 -0.000569
H  -0.570356 2.89703 0.000612
H  -3.060483 2.482085 0.000503
H  2.449136 -2.174804 -0.000821
H  -4.565287 -1.061373 -0.000368
H  -4.841311 0.462127 -0.890262
H  -4.841319 0.461725 0.890214
H  3.581788 2.140315 0.898325
H  3.58164 2.14082 -0.89761
H  5.043208 1.542473 0.00007
