program: Gaussian 09
title: 000266898
version: EM64L-G09RevD.01
frameworkgroup: C1[X(C12H24O)]
method: RPBEPBE
basis: SDD
operation: Freq
keyword: #pfreq=noraman
keyword: PBEPBE/SDD
title: #p freq=noraman PBEPBE/SDD
converged: YES YES NO NO
title: Mulliken charges:
elementType: O C C C C C C C C C C C C H H H H H H H H H H H H H H H H H H H H H H H H
charge: -0.441173 -0.055441 -0.098209 -0.438134 -0.420170 -0.423989 -0.430152 -0.432556 -0.395815 -0.365476 -0.374718 -0.354672 -0.699711 0.174431 0.207724 0.198107 0.203198 0.225009 0.195095 0.215434 0.190599 0.196283 0.206922 0.202105 0.201054 0.202454 0.199832 0.193545 0.192866 0.187046 0.195517 0.198131 0.194983 0.315720 0.208663 0.209624 0.215872
chargesum: 0.00000
title: Mulliken charges with hydrogens summed into heavy atoms:
elementType: O C C C C C C C C C C C C
charge: -0.125453 0.118990 0.109514 -0.036829 -0.000066 -0.017956 -0.026947 -0.029397 0.006471 0.020935 0.007846 0.038443 -0.065551
polarizability: 1.52039668e+02 4.47131724e-01 1.27298702e+02 1.22102706e+00 1.76200050e+00 1.10749324e+02
1716.lowfreq: -20.6273 -7.6623 0.0003 0.0005 0.0008 11.7117 39.2984 54.5478 73.3306
frequency: 36.4877 53.7627 72.8148 102.4859 125.3338 141.5015 180.5823 208.0605 224.7176 233.2995 265.3464 286.8999 293.0130 310.9815 348.5024 384.6770 404.0334 429.9258 450.9190 477.6617 512.6747 589.2511 722.9229 732.0183 749.7600 772.5407 809.2608 823.0965 842.9809 875.5381 894.0238 903.7808 928.5619 947.4798 977.7888 997.9726 1010.8854 1020.3007 1049.8848 1055.9647 1079.0652 1092.4690 1102.4758 1122.9807 1132.4112 1135.8486 1161.9990 1176.2840 1201.4703 1203.1546 1226.1146 1242.6566 1260.4665 1264.9843 1272.2500 1280.2699 1290.6848 1296.5686 1313.6410 1323.7360 1334.3981 1341.1512 1342.7978 1351.4900 1356.1944 1358.0214 1363.4763 1369.0040 1374.2919 1388.6590 1459.1563 1461.6278 1464.7307 1465.7650 1469.8676 1472.8051 1474.9364 1476.4274 1482.6003 1488.5404 1497.2223 2897.3242 2950.0493 2956.7551 2960.7749 2962.8971 2966.5981 2968.8914 2970.4502 2971.7995 2974.3764 2985.5400 2992.4184 3006.3648 3013.3498 3017.3279 3021.1619 3024.4108 3030.1381 3032.2275 3037.7089 3043.5103 3066.5090 3069.5167 3531.0657
redmass: 3.2850 1.8616 2.4060 3.0177 2.9996 2.3063 2.8722 2.8083 1.2391 2.1215 2.3568 2.4609 1.0974 3.2261 2.4869 2.7469 2.5498 2.0766 2.1183 2.4947 2.3173 2.2983 1.4082 1.2899 1.8134 1.6089 1.6292 2.0929 1.8315 2.0007 1.8939 1.9690 2.0858 1.7479 2.1906 1.9940 2.1066 2.2719 2.1196 1.5690 2.1856 2.0871 2.1135 1.6061 1.6347 1.9712 2.1267 1.4167 1.2613 1.4187 1.3239 1.2503 1.2036 1.3186 1.2446 1.1803 1.0691 1.1815 1.3495 1.3675 1.3476 1.4122 1.4367 1.5038 1.4039 1.4312 1.3341 1.3229 1.3557 1.2189 1.0763 1.0781 1.0929 1.0711 1.0777 1.0758 1.0861 1.0428 1.0696 1.0891 1.0782 1.0809 1.0594 1.0603 1.0612 1.0609 1.0632 1.0586 1.0385 1.0623 1.0638 1.0646 1.0951 1.0982 1.0964 1.1005 1.1004 1.0967 1.0970 1.0980 1.1012 1.0933 1.1007 1.0992 1.0657
irintensity: 0.0113 0.1375 0.1080 0.4532 1.1763 0.5385 0.5661 0.4956 0.1848 1.0202 3.3152 0.7416 114.0184 3.7527 8.9222 19.7437 2.6116 0.1226 3.9837 5.0007 0.8686 2.0752 0.9685 18.2519 7.5184 1.2345 0.7819 10.6559 13.9969 4.5607 6.1735 0.9125 38.7948 15.8666 5.1470 7.2691 24.6452 9.3150 0.9339 3.5894 0.8590 17.9462 3.7186 0.7489 0.2265 4.0364 0.1307 21.3723 0.5751 3.6281 2.0431 1.3153 0.9983 3.2618 1.4715 8.3734 0.6727 0.7710 2.4393 0.3891 0.8003 1.4628 1.0191 0.8410 1.9020 3.1509 9.3389 0.9838 8.5716 11.9614 2.3149 0.5684 15.1690 0.4023 13.4801 6.8632 6.7065 12.3364 1.5452 23.5622 23.5862 35.7122 6.6447 36.8181 8.0300 14.1092 26.0717 80.0597 31.5176 8.2969 50.0321 36.5541 2.4579 33.3604 60.5929 4.7203 48.7973 73.9626 83.5004 24.1714 50.2327 96.3643 90.6732 54.1433 3.3941
temp: 298.150 k
press: 1.00000 atm
elementType: 8 6 6 6 6 6 6 6 6 6 6 6 6 1 1 1 1 1 1 1 1 1 1 1 1 1 1 1 1 1 1 1 1 1 1 1 1
symmnumber: 1
zpe: 889253.4 jmol-1
zpe.correction: 0.338699 hartree
zpe.thermalcorrener: 0.353711 hartree
zpe.thermalcorrenthalpy: 0.354655 hartree
zpe.thermalcorrgfe: 0.296868 hartree
zpe.sumelectzpe: -545.794648 hartree
zpe.sumelectthermal: -545.779636 hartree
zpe.sumelectthermalent: -545.778691 hartree
zpe.sumelectthermalfe: -545.836478 hartree
dipole: -0.3742 -1.1911 1.5093
dipole: 1.9587
quadrupole: -82.9504 -87.1047 -83.2318
quadrupole: 1.4538 -0.8509 5.9037
quadrupole: 1.4785 -2.6757 1.1972 1.4538 -0.8509 5.9037
hfenergy: -546.1333463 hartree
pointgroup: C01 [X(C12H24O1)]
dipole: 0.1390685 0.4733061 0.592039 debye
polarizability: 152.0368072|0.7316463|127.2933278|-1.0079102|-1.8577643|110.7575588 unknown
InChI: InChI=1S/C12H24O/c1-2-3-8-11-9-6-4-5-7-10-12(11)13/h11-13H,2-10H2,1H3
charge 0 multiplicity 1
37 atoms
O  0.641229 -2.714146 -0.292329
C  -0.112179 -0.511539 0.551474
C  1.038177 -1.281714 -0.169249
C  0.272713 0.877069 1.135224
C  -1.362939 -0.464624 -0.368309
C  2.448918 -1.17064 0.469142
C  0.570352 2.021551 0.137947
C  3.415668 -0.158477 -0.204481
C  1.783821 1.814819 -0.807248
C  3.092756 1.356142 -0.099669
C  -2.662835 0.011032 0.317663
C  -3.894443 -0.076431 -0.61374
C  -5.194824 0.420319 0.053599
H  -0.374946 -1.138229 1.438347
H  1.095297 -0.975476 -1.228949
H  1.141979 0.754946 1.810365
H  -0.558416 1.207378 1.790196
H  -1.519725 -1.481869 -0.778371
H  -1.150907 0.191234 -1.238686
H  2.911141 -2.172027 0.365095
H  2.375803 -0.963586 1.55637
H  0.752402 2.938904 0.735439
H  -0.330412 2.231566 -0.473309
H  3.492861 -0.424483 -1.279693
H  4.425388 -0.323508 0.224613
H  1.966554 2.776255 -1.327033
H  1.526647 1.091183 -1.605239
H  3.950289 1.898674 -0.545351
H  3.066684 1.660793 0.966898
H  -2.849104 -0.602831 1.224758
H  -2.554264 1.058187 0.667198
H  -4.023322 -1.126349 -0.946864
H  -3.69814 0.516816 -1.530512
H  0.484953 -3.065535 0.622735
H  -5.102313 1.478665 0.363481
H  -5.429082 -0.173115 0.957823
H  -6.058183 0.343944 -0.632937
