program: Gaussian 09
title: 000266896
version: EM64L-G09RevD.01
frameworkgroup: C1[X(C10H18O2)]
method: RPBEPBE
basis: SDD
operation: Freq
keyword: #pfreq=noraman
keyword: PBEPBE/SDD
title: #p freq=noraman PBEPBE/SDD
converged: YES YES NO NO
title: Mulliken charges:
elementType: O O C C C C C C C C C C H H H H H H H H H H H H H H H H H H
charge: -0.456485 -0.433156 -0.051935 -0.097835 -0.125889 -0.162013 -0.467389 -0.449004 -0.450094 -0.444572 -0.402745 -0.400388 0.226219 0.201360 0.183605 0.229190 0.244902 0.182713 0.224398 0.193476 0.187697 0.222055 0.225195 0.185964 0.194327 0.199152 0.188369 0.200678 0.333867 0.318339
chargesum: 0.00000
title: Mulliken charges with hydrogens summed into heavy atoms:
elementType: O O C C C C C C C C C C
charge: -0.122618 -0.114817 0.174284 0.103526 0.057716 0.067178 -0.039774 -0.031130 -0.040342 -0.033414 -0.009266 -0.011341
polarizability: 1.19878331e+02 1.90570465e+00 1.14443948e+02 9.64896087e-01 -1.15692552e+00 9.00379082e+01
1716.lowfreq: -17.4472 0.0007 0.0010 0.0010 13.8241 16.5799 89.2373 94.5502 143.9523
frequency: 89.2066 94.5264 143.9488 212.7833 234.2239 261.5691 268.6994 282.2203 299.2960 310.9411 370.3989 374.9630 398.2682 445.4849 458.1670 477.7577 495.5682 529.8114 578.2782 782.4336 818.8807 837.9140 841.0302 854.1703 896.0548 900.5679 938.4913 977.8209 991.2708 1001.2237 1007.0114 1041.1314 1055.0355 1066.6489 1081.0061 1107.3255 1111.5822 1119.5126 1136.8651 1147.2002 1186.9544 1193.8389 1209.5413 1216.8232 1253.3387 1261.7568 1280.7314 1283.8360 1292.3541 1302.4205 1320.8348 1328.5485 1332.8218 1338.2391 1341.3858 1343.4627 1348.3678 1352.2843 1368.3256 1390.8408 1462.4735 1462.5844 1463.9883 1468.6294 1469.3699 1474.9568 2900.6382 2907.6483 2946.6355 2954.1880 2958.9621 2962.1882 2964.5746 2968.0110 2971.5859 3020.3508 3025.4960 3031.8646 3032.7795 3045.6713 3053.2479 3057.6988 3536.8266 3558.6254
redmass: 2.8507 4.1360 2.6041 4.2488 2.0783 1.8215 1.9998 1.2691 1.6242 1.7689 5.2360 3.7209 2.8331 2.8797 3.2226 3.0821 2.2831 1.6684 3.5123 1.7948 1.9720 1.8741 2.1122 1.7274 2.3360 1.6050 2.9602 2.8144 1.9519 2.0095 2.4342 2.4975 1.2515 1.7093 1.7641 1.5077 2.2316 2.4159 1.9000 1.6224 1.5204 1.4634 1.3239 1.3851 1.2754 1.3826 1.2924 1.3035 1.2603 1.2009 1.4033 1.4053 1.3554 1.4215 1.4955 1.5792 1.4841 1.5567 1.2085 1.6630 1.0880 1.0878 1.0928 1.0925 1.0840 1.0957 1.0814 1.0813 1.0746 1.0666 1.0699 1.0682 1.0662 1.0629 1.0616 1.0855 1.0963 1.1000 1.0998 1.0974 1.0968 1.0946 1.0657 1.0661
irintensity: 0.6135 3.8501 0.6637 2.2656 8.0264 31.7698 14.4386 73.2228 13.0761 140.8814 0.8156 2.1300 4.5469 11.8304 7.2580 3.5420 0.2576 1.4257 9.6958 2.6047 3.5043 10.5377 9.4791 18.8922 4.5869 1.3232 60.8060 20.2378 9.9640 8.1675 88.1918 8.9221 0.8298 4.4149 30.1841 5.8374 0.0075 12.9099 6.6509 4.1544 1.3031 14.1348 1.6921 14.4331 1.0938 20.7855 3.0725 2.1863 6.8683 0.1473 1.8165 0.1304 4.2206 1.9670 1.0747 4.1877 2.1944 1.0533 38.9716 5.3958 12.1548 7.2602 6.7224 11.6742 15.4698 2.7603 0.9985 49.4117 4.7268 31.2885 8.2846 24.3442 68.1938 69.8669 48.8151 14.9954 74.0342 34.4371 81.8199 47.2930 59.0956 38.5422 5.4552 2.6653
temp: 298.150 k
press: 1.00000 atm
elementType: 8 8 6 6 6 6 6 6 6 6 6 6 1 1 1 1 1 1 1 1 1 1 1 1 1 1 1 1 1 1
symmnumber: 1
zpe: 697931.2 jmol-1
zpe.correction: 0.265828 hartree
zpe.thermalcorrener: 0.277579 hartree
zpe.thermalcorrenthalpy: 0.278523 hartree
zpe.thermalcorrgfe: 0.229264 hartree
zpe.sumelectzpe: -541.334250 hartree
zpe.sumelectthermal: -541.322499 hartree
zpe.sumelectthermalent: -541.321555 hartree
zpe.sumelectthermalfe: -541.370814 hartree
dipole: 1.2801 0.8909 1.8670
dipole: 2.4327
quadrupole: -69.8453 -84.1705 -71.1726
quadrupole: 6.1022 2.4713 -1.8111
quadrupole: 5.2175 -9.1077 3.8902 6.1022 2.4713 -1.8111
hfenergy: -541.6000779 hartree
pointgroup: C01 [X(C10H18O2)]
dipole: -0.5073953 -0.3451806 0.7344811 debye
polarizability: 119.9538071|1.7910461|114.3323117|-1.1024865|1.3930263|90.0740687 unknown
InChI: InChI=1S/C10H18O2/c11-9-5-6-10(12)8-4-2-1-3-7(8)9/h7-12H,1-6H2
charge 0 multiplicity 1
30 atoms
O  -1.062403 -2.827281 -0.191352
O  -1.031405 2.911636 0.133174
C  0.199074 -0.761048 -0.185759
C  0.231933 0.746827 0.208579
C  -1.095688 -1.435777 0.305727
C  -1.041799 1.486453 -0.267708
C  1.464774 -1.489058 0.330281
C  1.523314 1.411849 -0.327388
C  -2.352011 -0.695944 -0.197895
C  -2.326622 0.790916 0.226296
C  2.758617 -0.816034 -0.181439
C  2.791073 0.688197 0.180424
H  0.191746 -0.826485 -1.296543
H  0.253038 0.804106 1.323832
H  -1.101028 -1.43844 1.421948
H  -1.044773 1.539707 -1.373029
H  1.421462 -2.548506 0.021668
H  1.45888 -1.475652 1.441743
H  1.53359 2.479745 -0.040807
H  1.504835 1.381621 -1.437658
H  -3.267889 -1.185868 0.191588
H  -2.383217 -0.776159 -1.302841
H  -3.2091 1.327333 -0.167238
H  -2.368329 0.863026 1.335252
H  2.814819 -0.92568 -1.284434
H  3.645058 -1.331894 0.236174
H  2.857835 0.796582 1.283414
H  3.695829 1.16679 -0.2423
H  -1.905249 -3.278742 0.06793
H  -1.047966 2.949575 1.124562
