program: Gaussian 09
title: 000266890
version: EM64L-G09RevD.01
frameworkgroup: C1[X(C9H11N7O2S)]
method: RPBEPBE
basis: SDD
operation: Freq
keyword: #p
keyword: freq=noraman
keyword: PBEPBE/SDD
title: #p freq=noraman PBEPBE/SDD
converged: YES YES NO NO
title: Mulliken charges:
elementType: S O O N N N N N N N C C C C C C C C C H H H H H H H H H H H
charge: 0.240960 -0.269569 -0.250772 -0.393273 -0.358164 -0.001133 -0.144163 0.004376 0.007878 0.027119 -0.354305 -0.622074 -0.195540 0.250397 -0.058489 0.386592 -0.350356 -0.372701 -0.634729 0.260639 0.239716 0.334739 0.265502 0.329307 0.342999 0.251480 0.252294 0.266466 0.243819 0.300984
chargesum: 0.00000
title: Mulliken charges with hydrogens summed into heavy atoms:
elementType: S O O N N N N N N N C C C C C C C C C
charge: 0.240960 -0.269569 -0.250772 -0.063966 -0.015165 -0.001133 -0.144163 0.004376 0.007878 0.027119 0.146050 -0.021833 -0.195540 0.250397 -0.058489 0.386592 -0.098876 -0.120407 0.176540
polarizability: 2.20064230e+02 -3.97008414e+01 1.71367377e+02 -1.80811875e+01 -2.06559626e+01 1.18603554e+02
1716.lowfreq: -11.7251 -8.6229 -0.0018 0.0018 0.0019 3.2003 21.3613 31.5098 50.3227
frequency: 20.7496 31.2583 50.3091 61.4961 73.0937 106.6731 115.1436 153.0404 164.8840 170.5699 214.3806 229.1016 249.0492 272.3405 303.9558 306.4122 342.3889 386.6752 396.3627 419.5718 421.8488 478.3956 495.3492 505.8473 584.0850 589.5087 594.7160 611.1724 642.8942 649.1756 660.6524 706.7562 741.1903 789.4912 796.6133 810.1413 839.4166 870.5789 888.9782 919.1947 928.2594 938.3490 953.2052 1020.4428 1061.7089 1079.7642 1128.6610 1142.2885 1159.2863 1175.7561 1194.0137 1205.7035 1240.3476 1248.9448 1284.8128 1286.3010 1293.8300 1310.4315 1333.7465 1356.8510 1362.4094 1370.2782 1403.3287 1415.7636 1422.0599 1437.5194 1443.9181 1457.8782 1479.0340 1495.7435 1514.5380 1585.0390 1657.7711 2993.5338 3010.0339 3041.6413 3080.5840 3090.5576 3125.7802 3138.2525 3147.2315 3175.0472 3512.5535 3584.8699
redmass: 9.2852 6.5516 8.3922 6.5574 5.8535 5.0466 8.4811 2.8581 1.2910 4.3735 6.0546 4.4783 4.7209 5.7821 3.2194 6.4216 3.1262 8.0293 6.2603 4.2661 4.5128 6.9938 3.6995 4.5404 1.2791 11.1912 4.4697 4.5599 5.5588 1.3659 4.9570 9.0690 3.7637 7.8162 6.5959 3.8968 2.3965 7.3687 1.4739 2.4701 9.0822 1.4786 2.6312 2.5417 3.2192 3.8189 1.3420 2.8034 2.5050 4.1318 1.2920 2.0060 6.6863 1.2920 3.4503 3.1653 2.3576 1.2332 3.9246 2.5729 2.2910 2.4910 1.7703 1.1974 1.1237 1.2706 1.7095 1.0713 1.0817 1.8882 9.1049 6.9520 9.0630 1.0369 1.0614 1.0590 1.1023 1.0977 1.1073 1.0933 1.1011 1.0926 1.0778 1.0818
irintensity: 2.5870 0.5982 2.2456 2.0794 0.2866 18.6902 2.7140 5.1017 0.4943 4.0057 5.8254 10.1202 7.3166 3.0311 3.2967 0.7269 18.7075 3.2351 5.3680 3.8729 0.5058 1.4088 3.3991 1.2345 88.9441 8.3323 16.0272 18.6312 8.2105 128.2298 19.0913 62.0651 20.3658 2.7491 6.7791 25.0193 8.8662 18.0955 25.1870 140.1393 4.9910 0.8187 9.5433 32.2753 23.7155 5.4715 4.6071 10.3724 51.7040 16.8878 5.4537 3.7611 37.9689 3.5451 9.3210 0.4449 9.5042 70.7653 102.5755 39.0080 115.2085 271.2873 67.0917 44.2315 17.0155 45.8473 64.0516 8.9133 24.3905 341.1984 19.0282 17.4377 176.3411 18.2075 25.7642 21.9425 6.9564 3.5996 1.8170 15.0207 0.9111 12.9297 41.3068 61.1808
temp: 298.150 k
press: 1.00000 atm
elementType: 16 8 8 7 7 7 7 7 7 7 6 6 6 6 6 6 6 6 6 1 1 1 1 1 1 1 1 1 1 1
symmnumber: 1
zpe: 567936.3 jmol-1
zpe.correction: 0.216316 hartree
zpe.thermalcorrener: 0.233991 hartree
zpe.thermalcorrenthalpy: 0.234935 hartree
zpe.thermalcorrgfe: 0.168832 hartree
zpe.sumelectzpe: -1279.879039 hartree
zpe.sumelectthermal: -1279.861364 hartree
zpe.sumelectthermalent: -1279.860419 hartree
zpe.sumelectthermalfe: -1279.926522 hartree
dipole: 1.4342 -5.9145 1.4109
dipole: 6.2473
quadrupole: -117.8972 -105.8257 -125.1523
quadrupole: 2.8557 2.2393 -7.8725
quadrupole: -1.6055 10.4660 -8.8605 2.8557 2.2393 -7.8725
hfenergy: -1280.0953543 hartree
pointgroup: C01 [X(C9H11N7O2S1)]
dipole: 0.3244898 2.2260731 -0.9901703 debye
polarizability: 206.7597236|49.8331645|173.1893575|17.1787266|-25.4747444|130.0860798 unknown
InChI: InChI=1S/C9H11N7O2S/c1-16(15-18)9(17)11-2-3-19-8-13-6-4-10-5-12-7(6)14-8/h4-5,11,13H,2-3H2,1H3
charge 0 multiplicity 1
30 atoms
S  1.017402 2.953559 -0.90517
O  2.906458 -0.56853 1.699895
O  0.516448 -2.994001 -1.392784
N  -1.55103 1.904104 -1.10922
N  2.777017 0.08048 -0.543682
N  -0.206752 0.751673 0.348674
N  1.70302 -1.909444 0.179398
N  -1.87806 -0.967553 0.972574
N  -4.069494 -0.713099 -0.115764
N  1.294756 -2.007329 -1.145689
C  3.371051 1.39374 -0.29527
C  2.375902 2.402552 0.314489
C  -0.290068 1.786608 -0.502314
C  -2.337074 0.857076 -0.610531
C  -1.473757 0.14464 0.299352
C  2.506063 -0.750814 0.518467
C  -3.651599 0.397427 -0.797247
C  -3.170399 -1.33173 0.718289
C  1.212117 -2.821023 1.226767
H  4.197618 1.274422 0.430404
H  3.795088 1.776645 -1.239175
H  1.859631 1.970922 1.186582
H  2.87781 3.342636 0.597878
H  -1.831961 2.622268 -1.775784
H  2.344544 -0.14994 -1.442605
H  -4.377647 0.874808 -1.464092
H  -3.535787 -2.222551 1.236422
H  1.791774 -2.61863 2.138258
H  1.338796 -3.864326 0.894355
H  0.140031 -2.620093 1.407425
