program: Gaussian 09
title: 000266889
version: EM64L-G09RevD.01
frameworkgroup: C1[X(C7H8ClN5O)]
method: RPBEPBE
basis: SDD
operation: Freq
keyword: #p
keyword: freq=noraman
keyword: PBEPBE/SDD
title: #p freq=noraman PBEPBE/SDD
converged: NO YES NO NO
title: Mulliken charges:
elementType: Cl O N N N N N C C C C C C C H H H H H H H H
charge: 0.004574 -0.285860 -0.369561 -0.329159 -0.026679 -0.060811 0.063461 0.161662 0.202911 0.144636 -0.393818 -0.363956 -0.369454 -0.507463 0.267310 0.240902 0.351503 0.331121 0.252376 0.241322 0.220472 0.224513
chargesum: 0.00000
title: Mulliken charges with hydrogens summed into heavy atoms:
elementType: Cl O N N N N N C C C C C C C
charge: 0.004574 -0.285860 -0.018058 0.001962 -0.026679 -0.060811 0.063461 0.161662 0.202911 0.144636 0.114393 -0.363956 -0.117078 0.178845
polarizability: 1.82618649e+02 3.00965186e+00 1.36126164e+02 6.39575006e+00 -2.33758131e+00 6.26114735e+01
1716.lowfreq: -10.0512 -1.9492 -0.0024 -0.0013 0.0012 5.8303 39.7520 64.8087 95.8133
frequency: 39.7168 64.8061 95.8122 107.3407 143.5691 163.2410 169.3559 219.6772 233.8419 302.3975 324.6916 378.7066 407.2271 439.0906 463.1419 496.6630 517.7848 554.5483 585.8506 604.0750 608.8008 656.9227 731.5523 773.9897 789.2858 846.4463 875.1878 914.4590 979.1668 1007.7497 1047.5123 1091.1081 1108.7587 1116.1224 1152.9166 1171.9464 1227.2658 1234.4985 1263.4299 1309.8644 1323.6501 1360.5395 1383.7745 1420.6147 1434.6941 1447.6988 1461.1862 1469.0152 1476.7402 1484.3051 1523.6984 1607.0515 2953.7701 3001.0232 3040.8925 3072.4206 3117.2899 3178.9149 3487.9706 3519.7037
redmass: 3.7714 4.3190 4.6465 4.2734 3.5068 2.6920 2.2727 5.5548 3.8578 4.8338 4.2845 5.5825 2.9835 2.5537 5.9056 4.5958 3.8485 2.0273 2.4386 6.6549 5.6102 5.0649 4.8832 10.9771 10.9836 5.8454 5.4178 1.4362 2.6393 2.7228 4.7869 5.1995 7.7650 1.2674 1.4794 4.4815 3.0477 1.2220 3.5108 3.3594 1.3893 2.3425 1.3539 2.1628 1.4778 1.2374 1.0760 1.3207 1.3725 4.9584 5.3654 8.0930 1.0325 1.0596 1.1040 1.1037 1.0999 1.0927 1.0785 1.0783
irintensity: 1.9037 0.7805 9.3469 1.5696 2.4656 4.7616 0.2064 2.8304 22.9777 12.7067 2.3870 8.0526 37.0977 105.3421 16.0298 65.1918 34.2518 168.0355 55.1488 20.1681 19.2787 78.3642 9.8678 2.9397 25.1347 30.1192 15.6639 12.6400 5.3181 24.0598 87.0774 7.7015 16.2836 1.4078 20.7269 40.0755 40.0544 5.9569 21.9268 8.7019 52.6251 118.4151 9.3258 72.8833 27.0206 30.2506 19.0932 17.2578 3.9928 144.3674 10.7668 413.4017 54.4274 15.4484 52.9764 6.7896 24.4089 12.2448 90.6120 49.5332
temp: 298.150 k
press: 1.00000 atm
elementType: 17 8 7 7 7 7 7 6 6 6 6 6 6 6 1 1 1 1 1 1 1 1
symmnumber: 1
zpe: 412612.8 jmol-1
zpe.correction: 0.157156 hartree
zpe.thermalcorrener: 0.170034 hartree
zpe.thermalcorrenthalpy: 0.170978 hartree
zpe.thermalcorrgfe: 0.116788 hartree
zpe.sumelectzpe: -1079.485832 hartree
zpe.sumelectthermal: -1079.472953 hartree
zpe.sumelectthermalent: -1079.472009 hartree
zpe.sumelectthermalfe: -1079.526200 hartree
dipole: -6.3468 -2.5609 1.0891
dipole: 6.9301
quadrupole: -88.7112 -87.4475 -86.9609
quadrupole: -1.9332 -5.4948 -1.3414
quadrupole: -1.0046 0.2590 0.7456 -1.9332 -5.4948 -1.3414
hfenergy: -1079.6429874 hartree
pointgroup: C01 [X(C7H8Cl1N5O1)]
dipole: 2.3106246 -1.2382166 -0.7495039 debye
dipolederiv: -0.0498294 0.0090853 0.0045555 0.1328212 -0.828925 -0.2320046 0.0319625 -0.2318104 -0.1334246 -0.9536606 -0.0202532 0.1957183 0.0077234 -0.3919688 -0.0771148 0.3548297 -0.0320327 -0.6265477 -0.493151 0.2219609 0.1300603 0.3692236 -0.4980565 -0.2319536 0.4824276 -0.3856166 -0.3412609 -0.3470945 0.1962174 -0.0691211 0.7868183 -0.7334975 0.1732865 -0.114701 0.3156429 -0.1645433 -1.4574347 0.1749278 -0.0359969 0.2097679 -0.3567413 -0.022535 -0.101993 0.0182883 -0.271766 -0.7937398 0.1728948 -0.0613241 -0.0967561 -0.4510903 -0.0915332 -0.1573964 -0.0413074 -0.2760066 -0.6761929 -0.1642995 -0.1405317 -0.190723 -0.6804636 -0.19727 -0.1554856 -0.2073281 -0.241423 0.9444103 -0.2260763 0.0256683 -0.8035808 0.817814 0.2433382 -0.0836691 0.2279748 0.1706074 0.7104182 0.2022984 0.0947001 0.4526293 -0.6557308 -0.1857256 0.2570316 -0.2490882 0.0876512 0.7813046 -0.2914466 0.1107925 -0.6474425 0.6548416 -0.0289037 -0.0753036 0.0654954 0.1886624 0.633796 -0.0828462 -0.1590025 -0.2090932 0.2753807 0.1182009 -0.2587791 0.0188426 0.2231342 0.4012338 -0.1002921 0.0544183 -0.0899003 1.4708505 0.4667138 0.0605492 0.4487687 0.1416473 0.4831934 -0.0693228 0.0909701 0.074098 0.5036756 0.1914526 0.1140081 0.1775711 0.0343749 0.4302919 0.0509721 -0.1070563 0.1531067 0.2525323 -0.0386903 -0.3327614 -0.0144885 0.5121006 -0.0463908 0.0111532 0.0181387 0.0540137 0.1007265 0.00836 0.0359792 -0.0152152 -0.0619559 -0.0085667 0.0001301 0.0325137 0.0006747 -0.0799492 0.0148563 0.0298856 0.0782692 0.0980751 0.4064041 -0.023824 -0.063725 0.0252652 0.2145518 -0.0399318 -0.1668901 0.0791848 0.3212782 0.1095221 -0.0184357 -0.0206901 -0.1086424 0.3815386 -0.0542889 0.076983 -0.1839097 0.2409435 -0.0293629 -0.053607 -0.0462298 -0.0538306 0.0604019 -0.035363 -0.0434708 -0.037212 0.1118209 -0.0418054 0.0965584 0.0628943 0.140109 0.0080825 -0.0370289 0.0649769 -0.0105783 0.0681911 0.0269407 -0.0621433 0.0311476 -0.1763782 -0.1322248 0.0531907 0.0515751 -0.0228144 0.0189368 -0.0302865 -0.0236518 -0.1479004 -0.0299039 0.0682518 0.0029443 -0.0697585 0.0013635 -0.1004956 unknown
polarizability: 179.5175357|-13.6970014|130.6937225|7.9834138|22.7954017|71.1450284 unknown
InChI: InChI=1S/C7H8ClN5O/c1-14-2-4-11-5-6(8)9-3-10-7(5)13-12-4/h3,12-13H,2H2,1H3
charge 0 multiplicity 1
22 atoms
Cl -2.004527 2.800353 0.876562
O  3.968039 -0.311264 0.598745
N  1.506853 -1.179977 0.059465
N  0.234595 -1.813903 -0.173258
N  0.485059 0.924339 0.662081
N  -2.075444 -1.56055 -0.539308
N  -3.1913 0.538884 -0.031368
C  1.524696 0.120206 0.549543
C  -0.778415 0.362463 0.307867
C  -0.907584 -0.999076 -0.140353
C  2.895065 0.580821 1.038152
C  -1.993181 1.070445 0.339147
C  -3.177035 -0.74373 -0.462282
C  4.459271 0.001856 -0.75442
H  2.907069 0.549009 2.141794
H  3.052882 1.628824 0.718984
H  2.277694 -1.79751 0.337488
H  0.243737 -2.55135 -0.883886
H  -4.128565 -1.174061 -0.784494
H  5.254173 -0.730518 -0.962429
H  4.880376 1.025923 -0.789473
H  3.654741 -0.092386 -1.511058
