program: Gaussian 09
title: 000266887
version: EM64L-G09RevD.01
frameworkgroup: C1[X(C14H12N4)]
method: RPBEPBE
basis: SDD
operation: Freq
keyword: #pfreq=noraman
keyword: PBEPBE/SDD
title: #p freq=noraman PBEPBE/SDD
converged: YES YES YES YES
title: Mulliken charges:
elementType: N N N N C C C C C C C C C C C C C C H H H H H H H H H H H H
charge: 0.005864 0.005865 0.005865 0.005865 0.026833 0.026833 0.275393 0.275394 -0.705672 -0.705678 -0.705673 -0.705678 0.136277 0.136277 -0.252123 -0.252123 -0.252123 -0.252123 0.224893 0.253893 0.253893 0.253894 0.253895 0.224894 0.253893 0.253893 0.224894 0.224894 0.253895 0.253894
chargesum: 0.00000
title: Mulliken charges with hydrogens summed into heavy atoms:
elementType: N N N N C C C C C C C C C C C C C C
charge: 0.005864 0.005865 0.005865 0.005865 0.026833 0.026833 0.275393 0.275394 0.027008 0.027005 0.027008 0.027005 0.136277 0.136277 -0.252123 -0.252123 -0.252123 -0.252123
polarizability: 2.24622044e+02 3.92375778e-05 1.89228313e+02 -5.36468568e-03 -4.59673985e-03 1.01995568e+02
1716.lowfreq: -0.0004 0.0006 0.0008 10.1358 11.3965 14.3927 38.8140 57.3286 66.8281
frequency: 38.8140 57.3286 66.8281 67.0391 107.3531 108.7004 109.8472 120.9602 125.7205 191.5549 215.8806 219.4021 222.6578 226.3888 226.8362 237.9408 241.1716 260.6063 278.5619 280.9638 282.5908 370.2170 373.5483 436.7058 446.4636 457.7339 481.9971 546.4197 573.9682 582.0381 585.5027 607.1132 609.7882 633.7151 696.8487 737.9329 806.9691 913.7429 936.4694 946.6620 949.4962 973.9747 991.4018 996.6532 1018.5491 1029.1589 1077.2978 1163.9661 1165.4572 1177.7054 1189.6627 1202.3418 1239.0011 1261.5177 1379.1237 1383.8611 1402.1895 1403.3495 1460.5269 1462.3519 1465.5241 1467.5802 1479.2350 1483.9679 1484.4210 1486.3300 1612.7123 1672.9117 2177.0212 2177.2005 2183.6497 2184.1974 2992.7321 2992.9453 2993.2387 2993.7108 3094.3864 3096.5790 3096.9170 3097.1865 3098.0519 3099.7189 3100.4193 3100.7429
redmass: 5.3392 13.1102 11.0695 4.9003 3.9399 13.8534 6.9178 3.2043 10.5523 1.8135 3.4863 1.3868 1.2063 2.7131 5.8047 1.5575 8.4685 1.0754 1.5257 4.1614 2.5203 2.9214 11.8258 8.9545 11.8555 9.7803 7.4606 7.2707 3.5504 10.2299 11.9350 8.4863 4.0675 2.8478 8.4935 7.4160 4.5615 3.0810 4.0967 1.5177 1.4544 3.5355 2.5523 1.2475 1.3301 2.1759 3.5919 4.6247 4.2999 3.1342 2.5035 7.1273 3.3321 5.4280 1.1648 1.1622 1.1808 1.2108 1.0458 1.0492 1.0451 1.0476 1.0576 1.0602 1.0529 1.0651 10.2148 11.3449 12.6318 12.6298 12.6466 12.6428 1.0340 1.0344 1.0342 1.0345 1.1016 1.1014 1.1011 1.1013 1.1010 1.1009 1.1006 1.1001
irintensity: 7.4078 0.0000 4.9089 0.0002 2.6678 0.0000 0.0000 0.0000 11.4841 0.0000 0.0000 0.0000 0.0000 0.0000 0.1691 0.0329 6.8312 0.0000 1.0257 0.0000 0.0000 0.6605 0.0000 0.0000 0.0000 0.0000 0.6582 0.0000 0.0000 1.1259 0.0000 2.1908 0.5258 0.0000 0.0000 4.0259 5.7316 50.6283 0.0000 0.0000 2.2650 0.0000 0.0000 0.0000 0.0000 21.9158 0.0000 3.9869 2.1658 0.0000 106.7656 0.0000 0.0000 3.8880 0.0000 36.4590 0.0000 13.2103 0.0000 0.0000 0.0000 17.9197 34.6218 0.0000 0.0000 19.1508 48.8685 0.0000 0.0000 9.8755 32.1330 0.0000 0.0002 12.6908 29.8788 0.0000 0.0000 28.5354 0.0000 0.0001 32.0824 0.0000 0.0002 33.4853
temp: 298.150 k
press: 1.00000 atm
elementType: 7 7 7 7 6 6 6 6 6 6 6 6 6 6 6 6 6 6 1 1 1 1 1 1 1 1 1 1 1 1
symmnumber: 1
zpe: 580128.7 jmol-1
zpe.correction: 0.220959 hartree
zpe.thermalcorrener: 0.240381 hartree
zpe.thermalcorrenthalpy: 0.241325 hartree
zpe.thermalcorrgfe: 0.173713 hartree
zpe.sumelectzpe: -758.313176 hartree
zpe.sumelectthermal: -758.293754 hartree
zpe.sumelectthermalent: -758.292810 hartree
zpe.sumelectthermalfe: -758.360422 hartree
dipole: 0.0000 0.0000 0.0003
dipole: 0.0003
quadrupole: -150.7665 -121.8029 -99.8689
quadrupole: 0.0000 0.0022 0.0012
quadrupole: -26.6204 2.3432 24.2772 0.0000 0.0022 0.0012
hfenergy: -758.5341352 hartree
pointgroup: C01[X(C14H12N4)]
dipole: 0.0000008 -0.0000001 -0.0001295 debye
polarizability: 224.622044|0.0004497|189.2283135|0.0053647|-0.0045967|101.9955684 unknown
InChI: InChI=1S/C14H12N4/c1-13(2)11(9(5-15)6-16)14(3,4)12(13)10(7-17)8-18/h1-4H3
charge 0 multiplicity 1
30 atoms
N  3.777311 2.2641 -0.000363
N  3.777375 -2.263921 -0.000108
N  -3.777326 2.263992 -0.000675
N  -3.777255 -2.264027 -0.00045
C  0.000042 -1.129463 -0.000439
C  0.000011 1.129537 -0.00056
C  1.053003 0.000051 -0.00042
C  -1.052949 0.000023 -0.000509
C  0.000107 -2.012172 -1.279395
C  0.000002 -2.012114 1.278556
C  0.000052 2.012111 -1.279609
C  -0.000053 2.012322 1.278342
C  2.422996 0.00007 -0.000322
C  -2.422942 0.000003 -0.000532
C  3.172796 1.232678 -0.000334
C  3.172831 -1.232517 -0.000199
C  -3.172777 1.23259 -0.000608
C  -3.172742 -1.232605 -0.000472
H  0.000141 -1.403716 -2.20027
H  0.895312 -2.658037 -1.286095
H  -0.895086 -2.658053 -1.286173
H  -0.895186 -2.658003 1.285284
H  0.895212 -2.657971 1.285363
H  -0.00005 -1.403618 2.199405
H  -0.895157 2.65797 -1.286454
H  0.895241 2.657998 -1.286379
H  0.000099 1.403559 -2.200421
H  -0.000084 1.403923 2.199254
H  0.895138 2.658206 1.285079
H  -0.89526 2.658185 1.285004
