program: Gaussian 09
title: 000266886
version: EM64L-G09RevD.01
frameworkgroup: C1[X(C28H24N2O2)]
method: RPBEPBE
basis: SDD
operation: Freq
keyword: #p
keyword: freq=noraman
keyword: PBEPBE/SDD
title: #p freq=noraman PBEPBE/SDD
converged: YES YES NO NO
title: Mulliken charges:
elementType: O O N N C C C C C C C C C C C C C C C C C C C C C C C C C C C C H H H H H H H H H H H H H H H H H H H H H H H H
charge: -0.253106 -0.253108 -0.315636 -0.315635 0.353771 0.353772 0.353447 0.353449 -0.383096 -0.394255 -0.394256 -0.383097 -0.356961 -0.389317 -0.389316 -0.356959 0.394423 0.394418 0.171083 0.171084 -0.353682 -0.353680 -0.341233 -0.341230 -0.778244 -0.778249 -0.228440 -0.228442 -0.225310 -0.225313 -0.249561 -0.249562 0.242779 0.244444 0.244443 0.242779 0.263051 0.265588 0.265588 0.263050 0.252416 0.252414 0.287156 0.287157 0.248765 0.260795 0.248695 0.260796 0.248762 0.248701 0.225402 0.225402 0.227779 0.227778 0.229250 0.229250
chargesum: 0.00000
title: Mulliken charges with hydrogens summed into heavy atoms:
elementType: O O N N C C C C C C C C C C C C C C C C C C C C C C C C C C C C
charge: -0.253106 -0.253108 -0.315636 -0.315635 0.353771 0.353772 0.353447 0.353449 -0.140317 -0.149811 -0.149813 -0.140318 -0.093910 -0.123729 -0.123729 -0.093908 0.394423 0.394418 0.171083 0.171084 -0.101266 -0.101265 -0.054077 -0.054072 -0.019989 -0.019990 -0.003038 -0.003041 0.002469 0.002466 -0.020311 -0.020312
polarizability: 5.43581371e+02 1.91452916e-05 2.77938080e+02 2.08963493e+01 6.21689318e-04 2.45665559e+02
1716.lowfreq: -0.6676 -0.0007 0.0007 0.0013 4.1612 5.1592 10.5259 17.2487 17.9893
frequency: 10.4454 17.2037 17.9785 29.2200 30.4591 48.9267 57.0219 58.6739 74.0508 84.5692 90.3482 102.5644 104.9495 126.5997 138.3427 140.9790 178.0712 185.1100 196.7177 242.5632 244.3433 289.1222 304.0570 330.4916 339.3747 348.9983 379.9059 402.6722 403.9227 405.2165 408.6021 413.5610 416.6252 448.8773 449.8050 480.4446 504.2456 506.5222 518.6603 535.9220 571.1540 583.0006 589.9143 597.0021 613.9172 614.0500 635.3987 637.4094 645.5486 664.1211 690.8276 691.5006 696.2343 732.0297 748.7984 755.6099 763.9157 765.6518 828.9092 834.2651 834.9331 845.0959 845.8052 853.3685 883.7601 886.5125 908.3617 908.4440 955.3217 956.7292 960.6736 963.5516 968.4741 968.5502 975.2773 977.3759 986.3449 986.3564 989.5406 989.5454 994.3390 1005.2151 1005.5305 1013.3798 1028.3160 1031.3064 1031.3142 1032.8360 1032.8909 1093.6572 1093.7578 1115.9714 1118.0420 1173.3273 1173.3324 1178.0577 1178.3041 1188.6462 1194.5325 1198.5261 1203.8334 1267.7303 1268.8799 1280.8114 1280.8571 1294.2741 1301.6131 1303.2729 1327.8979 1330.8446 1336.3081 1363.7879 1380.8117 1381.0208 1382.9101 1383.4062 1411.6147 1415.0870 1442.9820 1443.3799 1448.5330 1449.1991 1463.0414 1463.1800 1481.2682 1481.6760 1487.0283 1521.0612 1558.8385 1577.8550 1588.0243 1588.8041 1598.7556 1598.9594 1607.4710 1608.6538 1618.9532 1621.9282 3002.2345 3002.2386 3091.1572 3091.1617 3127.6829 3127.7443 3128.3295 3128.3501 3131.4759 3132.6242 3137.1533 3137.6787 3138.6870 3138.7065 3153.1742 3154.2096 3155.0271 3155.0280 3160.3617 3162.0093 3167.2819 3167.2986 3206.0544 3206.0563
redmass: 5.6819 3.8621 6.0126 3.7447 6.4152 4.2448 6.0057 6.4184 3.8628 3.1781 3.1336 5.6745 4.6785 3.6958 1.1089 1.2179 4.8607 5.1146 5.5684 4.4934 5.2708 5.2412 5.4569 6.1648 5.1767 3.7027 4.0817 4.0492 3.0280 3.5744 5.5373 3.0107 2.9136 4.1026 5.3837 5.5640 3.4660 3.2550 3.4800 3.8347 3.4105 3.0602 3.6061 2.9379 6.2665 6.1419 6.1916 6.2537 6.6841 5.6339 2.2517 1.9883 4.3343 4.0095 3.8779 3.8957 1.7502 2.0662 1.5582 1.2613 1.2700 1.2467 1.2544 1.9934 4.0352 3.3885 1.4441 1.4444 6.1896 2.9364 1.6735 1.3751 1.3764 1.3798 1.3733 1.4438 4.2328 4.2108 1.4395 1.4421 5.8568 1.8541 1.9190 2.7090 2.1494 1.7346 1.7313 1.8895 1.8951 1.5689 1.5717 1.4664 1.2982 1.0919 1.0967 1.7391 1.9705 1.2480 1.1225 1.3447 1.4247 3.7338 2.7793 5.0253 4.2247 4.2324 1.3470 1.3900 1.6777 1.4718 2.4368 8.5464 1.5015 1.4424 3.7170 4.2312 4.2787 3.1322 2.2420 2.2657 1.1088 1.1047 1.0572 1.0579 2.2301 2.2222 2.4297 3.0559 6.5639 7.4670 6.3485 6.4773 7.4809 7.5447 6.1106 6.2473 6.6953 6.6623 1.0367 1.0367 1.0971 1.0971 1.1005 1.1003 1.0850 1.0852 1.0881 1.0880 1.0877 1.0881 1.0898 1.0898 1.0965 1.0963 1.0940 1.0939 1.0971 1.0973 1.0998 1.0998 1.0943 1.0943
irintensity: 0.2091 2.0731 0.5965 0.0209 2.0847 1.9389 0.6579 2.1348 0.2737 5.5170 0.7548 0.0986 2.1799 1.4782 0.2445 0.3601 1.9270 1.0698 0.5593 1.8903 3.7361 0.0718 0.2925 3.4952 2.6969 0.1477 16.3023 3.6620 0.5648 3.5794 1.2195 0.2018 0.5355 2.2579 2.3186 1.5056 2.3831 25.9287 7.2186 3.7651 39.4402 3.5267 17.4000 18.8272 0.6112 0.2894 0.4274 12.2183 2.0121 0.0195 59.8525 7.4518 13.3633 8.4958 6.0856 7.8262 94.2895 23.3589 57.7733 1.1848 9.4392 0.1708 7.0823 1.6935 1.1212 2.9925 3.0805 2.4961 5.6819 1.3207 3.2348 3.1802 0.1927 4.2772 0.2719 0.1783 0.1133 0.0002 0.3523 0.2157 32.1702 18.3285 10.9499 0.4535 0.0884 10.1045 14.8439 12.6538 17.9184 5.9897 3.5592 15.6257 1.8932 0.0753 0.0003 0.1418 1.1108 1.9925 1.8933 24.2297 4.0484 213.8379 26.4613 256.1798 447.1370 1.3616 15.2916 38.8108 4.4906 18.1452 16.1632 2.6318 13.3174 33.3939 8.1247 15.5130 5.4141 5.5954 47.3975 2.4146 68.4164 8.9682 38.0624 6.3562 139.1143 102.6280 241.6865 0.1904 3.2831 1.8373 79.0403 3.0869 35.8392 331.5180 22.4446 158.6086 0.6726 54.6669 7.7291 5.5065 9.7091 8.9872 30.7257 7.0141 3.2370 0.4445 0.6297 39.9911 9.7345 1.2421 12.1832 15.2348 1.9640 15.1733 55.6271 19.4522 5.1194 0.4375 5.8729 30.4587 2.1868 0.3706
temp: 298.150 k
press: 1.00000 atm
elementType: 8 8 7 7 6 6 6 6 6 6 6 6 6 6 6 6 6 6 6 6 6 6 6 6 6 6 6 6 6 6 6 6 1 1 1 1 1 1 1 1 1 1 1 1 1 1 1 1 1 1 1 1 1 1 1 1
symmnumber: 1
zpe: 1160479.4 jmol-1
zpe.correction: 0.442003 hartree
zpe.thermalcorrener: 0.470278 hartree
zpe.thermalcorrenthalpy: 0.471223 hartree
zpe.thermalcorrgfe: 0.378435 hartree
zpe.sumelectzpe: -1339.140154 hartree
zpe.sumelectthermal: -1339.111879 hartree
zpe.sumelectthermalent: -1339.110935 hartree
zpe.sumelectthermalfe: -1339.203723 hartree
dipole: 0.0001 0.4447 0.0000
dipole: 0.4447
quadrupole: -252.1542 -177.5094 -179.8625
quadrupole: 0.0009 27.5729 0.0004
quadrupole: -48.9788 25.6660 23.3128 0.0009 27.5729 0.0004
hfenergy: -1339.5821577 hartree
pointgroup: C01 [X(C28H24N2O2)]
dipole: 0.0000505 0.0000104 -0.1749501 debye
polarizability: 544.3386472|14.5079051|244.9082831|-0.0067638|-0.0046484|277.9380801 unknown
InChI: InChI=1S/C28H24N2O2/c1-21(31)29(25-9-5-3-6-10-25)27-17-13-23(14-18-27)24-15-19-28(20-16-24)30(22(2)32)26-11-7-4-8-12-26/h3-20H,1-2H3
charge 0 multiplicity 1
56 atoms
O  6.870134 -1.683159 1.568354
O  -6.870032 1.682914 1.569097
N  5.0166 -0.612178 0.59392
N  -5.016569 0.612088 0.594361
C  0.739127 -0.091833 0.585284
C  -0.739095 0.091746 0.585349
C  3.574437 -0.443645 0.591989
C  -3.574404 0.443556 0.592304
C  1.612583 0.982553 0.917112
C  -1.323936 1.343922 0.248396
C  1.323944 -1.343966 0.248128
C  -1.612526 -0.982685 0.917095
C  3.010095 0.812598 0.919532
C  -2.722429 1.518062 0.24501
C  2.722436 -1.518107 0.244619
C  -3.010039 -0.812731 0.919635
C  5.758758 0.040764 -0.467944
C  -5.758793 -0.040637 -0.467586
C  5.634234 -1.417147 1.586843
C  -5.63414 1.416853 1.587489
C  5.106186 0.298449 -1.703329
C  -5.106287 -0.298118 -1.703049
C  7.107509 0.452353 -0.295816
C  -7.107549 -0.452216 -0.29547
C  4.734865 -1.937847 2.706662
C  -4.734697 1.937363 2.707339
C  5.788618 0.9593 -2.746272
C  -5.788789 -0.95876 -2.746079
C  7.778829 1.109597 -1.348864
C  -7.778938 -1.109249 -1.348604
C  7.130169 1.369582 -2.577802
C  -7.130343 -1.369032 -2.577621
H  1.193133 1.951107 1.2104
H  -0.682431 2.178386 -0.055086
H  0.682417 -2.178391 -0.055417
H  -1.193056 -1.951278 1.210225
H  3.672301 1.644456 1.181091
H  -3.160128 2.479005 -0.046452
H  3.160114 -2.479011 -0.0470
H  -3.672226 -1.644624 1.181128
H  4.069442 -0.018839 -1.851479
H  -4.069541 0.019166 -1.851193
H  7.627744 0.241587 0.638638
H  -7.627733 -0.241604 0.639047
H  4.017932 -1.17992 3.064316
H  5.391115 -2.252868 3.531833
H  4.151964 -2.815695 2.375583
H  -5.390897 2.252325 3.532572
H  -4.017808 1.179338 3.064874
H  -4.151739 2.815207 2.376353
H  5.269215 1.147393 -3.69257
H  -5.269435 -1.146698 -3.692435
H  8.819481 1.420025 -1.20265
H  -8.819592 -1.419672 -1.202397
H  7.660722 1.879767 -3.38889
H  -7.66095 -1.879056 -3.388775
