program: Gaussian 09
title: 000266884
version: EM64L-G09RevD.01
frameworkgroup: C1[X(C23H23NO4S)]
method: RPBEPBE
basis: SDD
operation: Freq
keyword: #p
keyword: freq=noraman
keyword: PBEPBE/SDD
title: #p freq=noraman PBEPBE/SDD
converged: YES YES NO NO
title: Mulliken charges:
elementType: S O O O O N C C C C C C C C C C C C C C C C C C C C C C C H H H H H H H H H H H H H H H H H H H H H H H
charge: 0.945062 -0.527953 -0.526704 -0.237580 -0.238630 -0.418878 0.197397 -0.487433 0.270001 -0.085272 -0.261847 0.323713 -0.393890 -0.252434 -0.214324 -0.259525 0.310128 -0.242322 0.447180 -0.368064 -0.371547 -0.384442 -0.407858 -0.798452 -0.243517 -0.245527 -0.248968 -0.247634 -0.672223 0.279947 0.225421 0.247562 0.258058 0.283783 0.289034 0.231919 0.231678 0.244858 0.244824 0.306060 0.246954 0.241455 0.232122 0.232758 0.230891 0.225259 0.227161 0.229276 0.238188 0.249966 0.228018 0.216354
chargesum: 0.00000
title: Mulliken charges with hydrogens summed into heavy atoms:
elementType: S O O O O N C C C C C C C C C C C C C C C C C C C C C C C
charge: 0.945062 -0.527953 -0.526704 -0.237580 -0.238630 -0.418878 0.197397 0.017935 0.270001 -0.085272 -0.014286 0.323713 -0.135833 0.031349 0.074710 -0.027606 0.310128 -0.010644 0.447180 -0.123205 -0.126723 -0.078382 -0.160904 -0.092117 -0.012626 -0.020267 -0.021807 0.219829 0.022114
polarizability: 4.16408250e+02 4.53660381e+00 2.67039746e+02 3.43590473e+01 -2.11807422e+01 2.39399375e+02
1716.lowfreq: -7.2629 -0.0018 -0.0008 0.0013 3.1845 8.4365 10.3558 14.3066 20.0637
frequency: 9.5887 14.2394 19.9195 24.5280 32.7524 34.4611 45.7139 60.3256 66.1105 75.6643 77.2699 84.6184 102.0677 116.7008 120.7517 140.6981 159.3011 181.3774 191.5562 219.2188 223.2694 229.9730 270.0839 283.9890 290.9095 297.2992 303.0074 339.2947 359.9053 382.4164 389.3883 397.0443 407.1092 410.0049 430.1298 435.9419 442.3912 504.5603 524.0991 540.6083 552.1394 572.0819 578.2548 609.2250 615.7204 617.7221 620.8868 702.4653 706.3019 709.0684 721.1569 744.8204 751.6270 773.4159 777.8811 780.2212 786.8022 802.9514 809.4168 826.4371 850.1773 862.4029 878.0119 895.5033 935.3755 938.9211 957.1200 964.0463 983.0453 983.8662 986.0527 988.7875 990.7187 991.2080 992.7841 994.7654 1010.4034 1011.8153 1025.1205 1037.2358 1045.6928 1049.4537 1054.5603 1085.5922 1095.0928 1115.5561 1117.1716 1157.6294 1172.0555 1174.2439 1176.6939 1183.0160 1202.7810 1212.5397 1217.9598 1249.4033 1271.0075 1278.2872 1285.3075 1295.0625 1328.0246 1330.7323 1356.6497 1357.7218 1373.4109 1379.8502 1389.8001 1389.9455 1399.6247 1418.2125 1438.5621 1447.0294 1457.3915 1463.1883 1463.3145 1469.6260 1470.6290 1475.0869 1485.9130 1494.6150 1564.5841 1583.4903 1591.5845 1592.6309 1596.1626 1610.3715 1630.6433 2970.3090 2980.7678 2992.4681 3032.7480 3046.8153 3063.4088 3087.0572 3093.9352 3095.9132 3119.2712 3122.9734 3125.0998 3129.0242 3133.9841 3135.1233 3137.3924 3140.8136 3147.7239 3150.2451 3160.3022 3161.5578 3164.7792 3167.6386
redmass: 3.1788 1.1857 4.7370 4.1467 4.7147 4.8769 3.8152 4.9298 4.2538 5.7146 4.4874 4.5008 5.3155 4.9748 4.8544 5.4344 4.4148 4.3888 2.4344 2.6680 9.4875 3.8207 5.3363 5.0836 2.4045 6.5152 4.7966 4.3663 3.3376 3.9912 5.0211 7.2670 2.8768 2.9754 6.9681 4.4472 3.0569 3.3111 4.1263 5.2083 3.3676 4.2713 5.6213 6.8581 4.3985 6.1087 6.8554 5.2254 3.3660 1.9904 5.7901 1.9109 2.4949 4.3097 1.6062 2.4898 5.0253 7.1638 1.5444 1.3369 1.2449 1.2497 1.4227 3.4282 1.4568 7.3901 1.4090 1.3023 1.4348 1.5693 3.4450 2.1070 1.7477 2.3114 2.3209 6.9494 1.6679 2.1376 2.9188 2.1575 2.4166 1.5872 1.9455 1.6803 2.1413 1.7807 1.2849 1.6741 1.0591 1.2597 2.1117 1.1502 1.1420 3.3595 2.9797 1.6841 1.2101 1.3005 2.1051 1.2677 1.2630 1.4209 1.3948 4.9097 5.4235 6.3459 1.2516 2.8646 1.2191 2.1896 2.1992 1.1150 1.0919 1.8067 1.1811 2.3453 1.1035 1.0586 1.0528 2.5791 6.1036 6.0028 6.4961 6.3051 6.0687 5.8436 8.7053 1.0551 1.0393 1.0361 1.0605 1.1053 1.0943 1.0971 1.1001 1.1023 1.0845 1.1062 1.0856 1.0884 1.0887 1.0890 1.0897 1.0931 1.0943 1.0967 1.0957 1.1018 1.1008 1.0960
irintensity: 1.8293 0.0626 1.1508 0.8703 0.5284 0.2767 0.0720 0.1652 3.2959 0.9520 0.6911 0.1183 1.7096 1.0622 0.6957 0.6537 0.9502 0.9193 0.9298 3.6291 5.9808 2.1117 2.6257 3.2890 13.0081 2.4620 0.7844 1.2392 2.7825 0.9796 17.4626 17.9997 0.0839 1.2205 83.2489 3.7029 3.7521 75.9070 41.2178 12.6747 4.4239 3.5056 20.0722 5.3958 2.3487 1.2604 0.6764 3.5722 1.8067 36.6523 12.2766 71.8825 7.6152 3.8628 27.5561 18.5150 2.7440 76.8806 7.6322 30.1515 0.6261 0.8551 1.4469 18.4401 11.6688 53.8179 0.7969 1.4216 0.2873 0.4666 3.6481 0.2757 3.2024 4.4425 4.7216 7.3204 8.7256 11.0965 77.7520 1.6897 28.1561 14.0828 6.4826 4.5684 12.9593 8.8108 8.1396 1.7653 1.2581 52.6857 200.3978 12.1817 2.4821 30.4963 8.1910 4.3207 45.6460 101.3362 7.2582 3.1707 16.9793 1.7648 10.1702 4.1679 0.3291 0.2515 26.8175 6.3086 17.3991 7.9332 6.2524 26.5426 10.9116 29.9972 29.2472 21.0551 16.0424 13.6525 11.7456 0.6343 4.6592 2.2112 3.7356 6.7832 10.2836 0.0777 139.2536 31.1632 26.2340 25.8728 15.4194 10.7431 20.8540 28.3650 13.6989 1.8380 0.2931 23.3803 2.8223 15.6525 7.2346 12.3950 9.7470 22.4526 19.5582 5.1653 7.1526 55.8116 22.5475 7.0507
temp: 298.150 k
press: 1.00000 atm
elementType: 16 8 8 8 8 7 6 6 6 6 6 6 6 6 6 6 6 6 6 6 6 6 6 6 6 6 6 6 6 1 1 1 1 1 1 1 1 1 1 1 1 1 1 1 1 1 1 1 1 1 1 1
symmnumber: 1
zpe: 1058285.4 jmol-1
zpe.correction: 0.403080 hartree
zpe.thermalcorrener: 0.431870 hartree
zpe.thermalcorrenthalpy: 0.432814 hartree
zpe.thermalcorrgfe: 0.338176 hartree
zpe.sumelectzpe: -1641.697780 hartree
zpe.sumelectthermal: -1641.668990 hartree
zpe.sumelectthermalent: -1641.668045 hartree
zpe.sumelectthermalfe: -1641.762683 hartree
dipole: -3.7924 2.0577 -3.3121
dipole: 5.4393
quadrupole: -128.4653 -171.5400 -189.6357
quadrupole: -5.1903 13.4451 2.4877
quadrupole: 34.7484 -8.3264 -26.4220 -5.1903 13.4451 2.4877
hfenergy: -1642.1008592 hartree
pointgroup: C01[X(C23H23N1O4S1)]
dipole: 0.8414094 -1.5357392 -1.2300755 debye
polarizability: 360.1079247|-78.50855|322.2032693|5.7334102|28.0568125|240.5361779 unknown
InChI: InChI=1S/C23H23NO4S/c1-3-28-23(25)17-24(29(26,27)20-15-13-18(2)14-16-20)22-12-8-7-11-21(22)19-9-5-4-6-10-19/h4-16H,3,17H2,1-2H3
charge 0 multiplicity 1
52 atoms
S  1.694619 0.212336 1.473996
O  0.645897 -0.359936 2.576335
O  2.612371 1.535953 1.739647
O  -0.235299 3.559804 -0.374434
O  -0.352678 2.660611 -2.52711
N  0.593032 0.690017 -0.07664
C  0.012132 -0.434819 -0.765202
C  1.249054 1.742421 -0.882787
C  -1.408114 -0.625902 -0.715908
C  2.885795 -1.211861 1.096864
C  0.823919 -1.297448 -1.553591
C  -2.351203 0.291838 -0.006829
C  -1.947469 -1.71374 -1.459109
C  4.173226 -0.892872 0.634952
C  2.450195 -2.52586 1.331651
C  0.264163 -2.37206 -2.268893
C  0.146908 2.690793 -1.3784
C  -1.13367 -2.581625 -2.214101
C  4.669408 -3.310526 0.586706
C  5.063091 -1.960371 0.382602
C  3.359715 -3.573989 1.070638
C  -2.166411 0.690052 1.344518
C  -3.499699 0.759524 -0.706172
C  5.626432 -4.449162 0.286238
C  -3.108633 1.534428 1.971919
C  -4.4372 1.607005 -0.076817
C  -4.245579 1.997291 1.269092
C  -1.410353 4.445462 -0.659015
C  -0.972783 5.714803 -1.394001
H  1.935481 2.301552 -0.218641
H  1.787149 1.351456 -1.768373
H  1.903436 -1.112806 -1.603347
H  -3.029054 -1.883188 -1.420684
H  4.478492 0.151911 0.516092
H  1.446485 -2.715696 1.724149
H  0.904243 -3.033321 -2.862604
H  -1.588132 -3.415548 -2.760312
H  6.078854 -1.740273 0.034467
H  3.048076 -4.609289 1.25023
H  -1.296113 0.334181 1.904172
H  -3.639448 0.482243 -1.757608
H  5.520129 -4.786127 -0.7632
H  6.677696 -4.144226 0.427366
H  5.432542 -5.323099 0.931712
H  -2.952707 1.826126 3.016612
H  -5.31084 1.961902 -0.635489
H  -4.974014 2.65006 1.763956
H  -1.811047 4.658216 0.344271
H  -2.145859 3.865382 -1.243429
H  -0.593176 5.474869 -2.401145
H  -0.186447 6.245092 -0.829321
H  -1.837316 6.395917 -1.503021
