program: Gaussian 09
title: 000266882
version: EM64L-G09RevD.01
frameworkgroup: C1[X(C22H21NO3S)]
method: RPBEPBE
basis: SDD
operation: Freq
keyword: #p
keyword: freq=noraman
keyword: PBEPBE/SDD
title: #p freq=noraman PBEPBE/SDD
converged: YES YES NO NO
title: Mulliken charges:
elementType: S O O O N C C C C C C C C C C C C C C C C C C C C C C H H H H H H H H H H H H H H H H H H H H H
charge: 0.890692 -0.506351 -0.544183 -0.211669 -0.438410 -0.214054 0.349728 0.002044 -0.690509 0.136328 0.292744 -0.343555 -0.259353 -0.250711 -0.248547 0.451383 -0.341069 -0.387992 -0.211241 -0.234304 -0.359075 -0.343386 -0.233217 -0.799504 -0.230020 -0.249122 -0.227012 0.287136 0.223117 0.252496 0.221572 0.251116 0.271093 0.277693 0.289085 0.242903 0.244284 0.229550 0.231895 0.277948 0.265645 0.230819 0.229465 0.232832 0.242126 0.231172 0.236583 0.231832
chargesum: 0.00000
title: Mulliken charges with hydrogens summed into heavy atoms:
elementType: S O O O N C C C C C C C C C C C C C C C C C C C C C C
charge: 0.890692 -0.506351 -0.544183 -0.211669 -0.438410 0.073082 0.349728 0.002044 0.006676 0.136328 0.292744 -0.092439 0.011740 0.026983 0.040539 0.451383 -0.098166 -0.143708 0.018309 -0.002408 -0.081127 -0.077741 -0.002399 -0.095081 0.001152 -0.012538 0.004821
polarizability: 3.43460932e+02 1.19990855e+01 2.69587314e+02 3.18102813e+01 -4.00189100e+00 2.32220967e+02
1716.lowfreq: -29.5371 -6.4509 -5.5514 -3.0379 -0.0015 -0.0014 -0.0013 16.1799 17.0619
frequency: -29.4441 16.0236 16.7357 27.9166 30.5253 41.6269 50.0633 65.4119 77.8288 91.8136 117.9877 129.6100 148.0359 153.4997 158.7091 179.7613 201.8200 216.4468 229.9749 233.3073 257.1517 288.3230 303.0776 322.3922 338.2309 380.3335 386.7818 390.8435 406.0988 407.1589 410.4701 434.8467 447.4345 465.3188 477.9564 504.8137 530.9993 576.9525 593.3401 611.6716 612.9084 621.8064 647.1508 691.6590 699.7757 705.7601 706.3402 730.8318 757.8644 774.5921 789.1049 797.0475 825.9320 830.8889 847.5390 848.3222 872.1385 904.1743 917.8495 941.7868 955.0633 960.9233 964.4878 980.4535 982.9596 987.2384 988.1625 989.0709 996.8009 1000.3830 1005.1233 1014.6278 1020.6467 1028.1221 1029.6530 1049.5296 1053.6044 1066.3918 1078.2499 1092.6517 1110.8933 1118.4069 1170.0377 1172.9183 1181.9445 1184.0883 1200.3141 1209.0886 1217.8481 1236.9735 1296.5750 1306.4800 1311.2513 1331.0033 1342.6504 1373.7131 1381.1615 1381.7776 1387.5480 1391.1729 1400.2513 1433.1121 1435.7909 1454.7400 1468.5490 1470.3050 1470.4228 1473.3544 1474.4876 1482.8676 1559.6994 1581.2081 1592.3442 1594.1014 1596.9379 1597.3134 1610.1805 2981.9360 2996.5432 3013.7136 3062.2557 3092.5454 3095.1893 3117.3213 3128.0235 3128.9323 3135.3586 3135.6909 3139.6191 3140.3699 3145.4447 3154.7725 3157.7785 3164.1883 3166.5567 3167.0927 3168.1767 3175.1931
redmass: 1.0375 6.0349 5.2859 4.9632 3.8669 4.2620 4.8752 4.8030 4.8633 6.3384 5.1245 5.4474 4.7473 4.5836 5.6389 7.3375 4.6322 1.1693 7.2990 6.3287 3.4776 5.1477 4.2742 5.0699 4.9854 4.0707 6.3117 5.9352 3.0715 2.8953 3.0194 5.0781 4.4852 5.6826 4.8968 3.3830 4.9027 4.5957 5.9339 6.4814 6.4251 6.9550 4.7570 4.4616 1.8101 3.1445 2.0111 2.8665 2.2739 5.2609 2.7240 4.5477 1.4269 2.6068 1.2497 1.2456 1.2511 5.1042 3.6680 2.1131 3.1730 1.3204 1.4054 1.3913 1.3932 1.7940 5.7935 5.9245 2.9848 1.3335 1.3787 1.4463 2.1249 2.0981 1.9687 1.5869 2.4524 1.6104 1.5816 1.6119 2.7712 1.2902 1.0694 1.0670 1.1487 1.1436 1.1729 3.2301 3.0234 2.8969 1.2622 1.3763 1.5839 1.2766 1.3082 7.3628 5.0546 1.2048 7.9495 2.9682 1.2811 2.2252 2.2801 1.0475 2.1799 1.0609 1.0606 2.0488 1.1809 2.1188 7.5027 5.9953 6.0910 6.4848 6.1947 6.3436 6.0570 1.0380 1.0352 1.0828 1.0966 1.0993 1.0986 1.1016 1.0855 1.0851 1.0894 1.0894 1.0895 1.0893 1.0923 1.0939 1.0956 1.0953 1.0969 1.0967 1.1013 1.0989
irintensity: 0.5309 1.4412 0.4785 0.5430 0.1456 0.6816 0.6350 1.9391 0.9422 1.9204 2.6895 2.2722 0.8341 0.1287 1.4708 2.7893 2.0024 0.1122 11.1731 9.2968 0.7453 9.1768 3.5324 2.1780 4.4058 1.5741 9.1975 5.8790 0.7368 0.1204 2.5686 28.1853 18.6700 64.7359 26.6088 64.3786 53.0263 14.4892 30.5000 0.3966 0.1598 0.5188 3.4729 13.7720 69.0313 4.2467 34.6818 27.5498 11.1007 14.7150 69.6486 55.0951 40.4547 1.8611 0.3501 1.9012 0.4840 31.5218 35.2003 40.3936 19.3769 0.7709 1.4151 0.4663 1.3614 0.9674 1.3189 1.0562 5.0411 0.1798 0.4981 0.5743 6.7580 5.5855 21.3515 18.7421 29.9057 25.5291 9.1826 16.3395 10.7449 9.3955 0.4527 4.7636 3.4735 11.2799 11.9913 26.9841 6.2002 128.5604 2.5415 1.8397 30.2471 21.0217 4.0638 1.9365 3.6943 28.0781 3.4549 9.6657 14.5913 9.5970 22.6252 13.9300 18.3603 7.9488 13.3011 25.9995 17.2011 1.0105 117.8509 2.4580 26.5570 5.7122 0.8200 4.6931 13.5479 26.7802 21.4691 7.5289 15.4496 15.6127 24.3907 10.8655 1.5515 0.0419 14.3251 12.3103 9.3430 9.6247 5.2002 27.7682 11.0863 0.5907 14.7723 11.3816 38.4297 5.6992
temp: 298.150 k
press: 1.00000 atm
elementType: 16 8 8 8 7 6 6 6 6 6 6 6 6 6 6 6 6 6 6 6 6 6 6 6 6 6 6 1 1 1 1 1 1 1 1 1 1 1 1 1 1 1 1 1 1 1 1 1
symmnumber: 1
zpe: 974700.0 jmol-1
zpe.correction: 0.371244 hartree
zpe.thermalcorrener: 0.396467 hartree
zpe.thermalcorrenthalpy: 0.397411 hartree
zpe.thermalcorrgfe: 0.313129 hartree
zpe.sumelectzpe: -1527.327399 hartree
zpe.sumelectthermal: -1527.302175 hartree
zpe.sumelectthermalent: -1527.301231 hartree
zpe.sumelectthermalfe: -1527.385513 hartree
dipole: 4.8108 1.3271 -0.6424
dipole: 5.0317
quadrupole: -130.4721 -166.9736 -161.5537
quadrupole: 7.1375 10.7114 -7.6082
quadrupole: 22.5276 -13.9738 -8.5539 7.1375 10.7114 -7.6082
hfenergy: -1527.6986426 hartree
pointgroup: C01 [X(C22H21N1O3S1)]
dipole: 1.9067219 -0.5053082 -0.1672523 debye
polarizability: 328.3556632|-31.437008|285.8709991|29.135793|-12.6173255|231.0425507 unknown
InChI: InChI=1S/C22H21NO3S/c1-17-13-15-21(16-14-17)27(25,26)23(20-11-7-4-8-12-20)18(2)22(24)19-9-5-3-6-10-19/h3-16,18H,1-2H3
charge 0 multiplicity 1
48 atoms
S  -0.277314 -1.426681 -0.193291
O  -0.532779 -0.826169 -1.691411
O  -1.351676 -2.479072 0.45496
O  -1.875973 2.434448 2.224582
N  -0.048234 -0.088911 1.185285
C  -1.280667 0.08417 2.031669
C  0.737203 1.038516 0.742357
C  1.428898 -2.21083 -0.184272
C  -0.831278 0.169457 3.504872
C  -2.116082 1.335751 1.63976
C  -3.173705 1.251684 0.579479
C  1.979028 1.251558 1.396016
C  0.334293 1.902139 -0.312099
C  1.733907 -3.134378 0.82918
C  2.317324 -1.8622 -1.211447
C  3.957172 -3.408972 -0.206918
C  3.011417 -3.731716 0.805504
C  3.592457 -2.472811 -1.208654
C  2.793968 2.343164 1.026988
C  1.165982 2.977071 -0.690042
C  -3.813791 2.46456 0.192379
C  -3.571377 0.033058 -0.037099
C  2.39003 3.2060 -0.018711
C  5.320243 -4.076225 -0.222982
C  -4.822491 2.461914 -0.787885
C  -4.584552 0.034652 -1.020367
C  -5.21148 1.243262 -1.398787
H  -1.866875 -0.842824 1.88846
H  -1.715343 0.211482 4.166721
H  -0.239525 1.083455 3.674756
H  -0.230299 -0.719198 3.759653
H  2.277833 0.559863 2.190148
H  -0.60872 1.721667 -0.836744
H  0.993147 -3.388012 1.593811
H  2.015482 -1.15215 -1.987904
H  3.278393 -4.459535 1.580531
H  4.309608 -2.217724 -1.996758
H  3.742653 2.51458 1.547406
H  0.855646 3.639541 -1.505416
H  -3.49742 3.391283 0.682807
H  -3.105196 -0.921182 0.231414
H  3.026143 4.049343 -0.309975
H  6.007947 -3.580373 -0.928485
H  5.788126 -4.061651 0.777962
H  5.236944 -5.137054 -0.52724
H  -5.307535 3.400333 -1.078439
H  -4.877341 -0.908257 -1.493841
H  -5.995791 1.238571 -2.164334
