program: Gaussian 09
title: 000266881
version: EM64L-G09RevD.01
frameworkgroup: C1[X(C22H21NO3S)]
method: RPBEPBE
basis: SDD
operation: Freq
keyword: #p
keyword: freq=noraman
keyword: PBEPBE/SDD
title: #p freq=noraman PBEPBE/SDD
converged: YES YES NO NO
title: Mulliken charges:
elementType: S O O O N C C C C C C C C C C C C C C C C C C C C C C H H H H H H H H H H H H H H H H H H H H H
charge: 1.002173 -0.521347 -0.521045 -0.304937 -0.751812 0.369858 0.144449 0.319156 -0.039756 0.075830 0.329668 0.327044 -0.560417 -0.390011 -0.384039 -0.348730 -0.425156 -0.240854 -0.232305 0.450282 -0.222476 -0.363397 -0.371238 -0.281071 -0.812919 -0.806823 -0.798752 0.415152 0.271689 0.272796 0.286584 0.272812 0.235520 0.286175 0.275023 0.244999 0.243766 0.232096 0.233404 0.239762 0.226639 0.226144 0.229811 0.230224 0.231001 0.229924 0.230535 0.244567
chargesum: 0.00000
title: Mulliken charges with hydrogens summed into heavy atoms:
elementType: S O O O N C C C C C C C C C C C C C C C C C C C C C C
charge: 1.002173 -0.521347 -0.521045 -0.304937 -0.336660 0.369858 0.144449 0.319156 -0.039756 0.075830 0.329668 0.327044 -0.288728 -0.117215 -0.097455 -0.075918 -0.189636 0.045320 0.042718 0.450282 0.009620 -0.118398 -0.127472 -0.047667 -0.120373 -0.115787 -0.093726
polarizability: 3.88692228e+02 2.73670305e+01 2.57393100e+02 -1.30492786e+01 -1.52528344e+01 2.72091350e+02
1716.lowfreq: -26.6533 -3.8994 -2.7539 -0.6850 -0.0013 -0.0007 -0.0003 5.9085 13.8618
frequency: -26.4713 5.1928 13.7006 26.8568 41.0258 42.2247 63.2326 82.7872 105.7255 108.9624 120.0272 130.5018 147.5796 158.8323 171.8446 182.2260 193.1102 207.5018 226.1654 230.6550 251.6856 280.2342 294.3266 301.1482 316.3447 324.7098 380.4820 394.8895 396.5028 404.6166 413.8616 434.6967 441.3114 443.9924 501.6414 514.6191 523.2428 526.2935 578.7443 580.2646 588.6582 614.7235 621.4455 653.3945 686.3879 687.3806 706.5537 731.6347 737.3310 761.2251 773.4662 777.8391 802.2212 812.0727 823.8029 831.2237 844.5188 845.9525 865.9763 884.5351 918.3311 950.1000 957.9179 958.9233 961.7904 977.6652 978.8808 991.5784 993.0228 993.7651 994.9187 1007.1170 1031.3973 1044.2864 1049.1789 1050.5860 1053.4038 1100.4785 1119.9427 1129.8043 1158.5047 1172.7254 1185.1744 1202.0631 1212.7118 1218.8443 1240.2398 1279.4477 1291.2878 1297.1954 1307.2448 1326.9977 1371.2536 1380.7799 1381.3213 1391.0071 1393.4184 1398.8228 1403.3221 1409.0008 1427.5875 1460.3235 1465.7708 1470.5221 1471.4079 1473.2784 1474.2857 1474.3164 1477.2529 1494.5905 1503.9600 1559.9397 1572.8769 1594.1599 1595.3157 1613.8773 1618.5687 2971.2035 2972.9355 2980.7861 3042.7966 3046.8552 3054.9151 3063.5416 3087.2897 3090.8734 3092.8722 3124.7502 3133.5328 3136.3073 3137.9323 3144.1763 3149.0812 3156.2154 3161.4590 3162.7714 3166.1739 3172.8706
redmass: 1.0153 5.0939 4.5766 3.7872 4.9418 4.9220 4.5695 4.5566 1.1225 4.8954 4.8327 6.4078 3.0039 1.4585 6.2681 4.4776 3.7370 4.2862 7.7524 6.5347 5.3178 5.5110 2.7296 4.5535 4.5064 4.9570 3.7302 7.8440 5.6997 2.8507 4.5818 6.4371 2.8715 4.2108 3.1398 4.2697 4.0059 3.9001 5.8125 6.8794 5.2691 5.5626 6.9389 5.1439 5.2894 4.5540 3.2630 3.1225 4.3365 1.8741 2.4041 2.4562 3.5273 4.2671 1.7734 1.3611 1.4524 1.3872 3.7934 1.4088 1.4444 10.6952 1.4245 1.4428 2.1102 1.3445 1.3708 1.4120 5.5227 1.5160 1.4075 1.7832 1.4700 2.2023 1.6054 2.4344 1.6639 2.1109 1.2873 2.0717 1.6802 1.1752 1.1448 2.0017 1.3324 2.9612 2.5835 2.0118 1.5646 1.2654 1.9584 3.0554 6.0067 7.1016 7.1261 2.9078 1.2363 1.2185 1.6980 1.9693 2.6060 1.0483 1.1903 1.5309 1.4577 2.0929 1.0762 1.1148 1.1789 2.4876 4.0235 5.6627 6.2449 6.1615 6.7324 6.0885 6.2620 1.0376 1.0385 1.0390 1.0967 1.0966 1.0836 1.0947 1.0985 1.0979 1.1001 1.0885 1.0865 1.0892 1.0892 1.0916 1.0899 1.0952 1.0958 1.0948 1.0959 1.0999
irintensity: 0.4629 0.8404 0.8059 0.0568 0.2149 0.4036 0.6151 1.0876 0.1085 2.7470 0.6559 1.2050 1.3496 1.1647 0.9343 0.3315 1.0519 1.5367 13.1503 0.9989 7.2424 12.5336 2.4737 0.9368 4.5902 0.6950 1.7751 5.4996 33.8751 0.1236 15.1142 134.9990 5.0301 41.0842 73.4121 29.0979 13.3146 9.3099 12.9505 9.8144 56.5096 46.9919 0.1804 32.3213 16.4480 1.2212 2.5959 9.5885 1.4132 66.4840 29.1423 25.7439 89.9104 33.8802 57.6835 129.3725 19.3858 18.1790 28.7517 6.3019 14.1266 68.6588 3.3309 9.9366 7.6302 0.5781 1.1833 2.2259 2.1323 3.5899 2.2829 7.0165 15.9688 31.8351 27.7228 18.1641 0.3982 0.1736 8.1382 27.3999 1.5418 9.9556 11.9298 5.1110 42.9148 10.5741 15.5655 322.3061 147.5734 3.1580 146.5996 110.3745 8.3381 10.8646 6.7115 9.6610 7.1963 15.8196 70.5305 8.7798 51.6264 0.3472 25.1956 83.9719 80.0784 83.4382 17.9378 7.7325 12.4624 40.6875 112.4682 85.6283 16.5217 7.6016 1.7370 118.6705 33.6111 63.5767 13.8864 25.1293 37.4874 0.4356 521.3839 18.9332 29.7104 7.1246 14.2787 17.8789 3.9571 13.2983 7.4062 5.5464 11.7323 4.2086 1.8829 2.3046 6.4546 23.5906
temp: 298.150 k
press: 1.00000 atm
elementType: 16 8 8 8 7 6 6 6 6 6 6 6 6 6 6 6 6 6 6 6 6 6 6 6 6 6 6 1 1 1 1 1 1 1 1 1 1 1 1 1 1 1 1 1 1 1 1 1
symmnumber: 1
zpe: 973125.8 jmol-1
zpe.correction: 0.370644 hartree
zpe.thermalcorrener: 0.396048 hartree
zpe.thermalcorrenthalpy: 0.396993 hartree
zpe.thermalcorrgfe: 0.311723 hartree
zpe.sumelectzpe: -1527.357911 hartree
zpe.sumelectthermal: -1527.332507 hartree
zpe.sumelectthermalent: -1527.331563 hartree
zpe.sumelectthermalfe: -1527.416833 hartree
dipole: 3.5253 5.2512 6.2532
dipole: 8.8941
quadrupole: -139.1655 -159.2323 -167.6856
quadrupole: -14.7339 -17.2790 -7.8972
quadrupole: 16.1957 -3.8712 -12.3245 -14.7339 -17.2790 -7.8972
hfenergy: -1527.7285553 hartree
pointgroup: C01 [X(C22H21N1O3S1)]
dipole: 2.3004612 1.0677401 2.410888 debye
polarizability: 380.4813031|-38.6061354|264.287661|-25.0134745|-6.0145568|273.4077136 unknown
InChI: InChI=1S/C22H21NO3S/c1-15-8-12-19(13-9-15)27(25,26)23-21-7-5-4-6-20(21)22(24)18-11-10-16(2)17(3)14-18/h4-14,23H,1-3H3
charge 0 multiplicity 1
48 atoms
S  -3.099894 0.523662 -1.302362
O  -2.956548 0.852839 -2.88268
O  -4.415248 -0.209607 -0.684858
O  0.795545 -0.784838 -1.78073
N  -1.597222 -0.459236 -0.969391
C  -1.283136 -1.157299 0.1924
C  0.095468 -1.580596 0.38515
C  2.593086 -1.319969 -0.302592
C  -2.833448 2.123971 -0.331544
C  1.13015 -1.219811 -0.608554
C  4.875871 -1.69315 -1.186323
C  5.4222 -1.386897 0.101148
C  3.47744 -1.640463 -1.366742
C  3.14264 -1.005665 0.96786
C  -2.256414 -1.486955 1.182645
C  0.402185 -2.38877 1.521003
C  4.540018 -1.036177 1.153043
C  -2.040111 3.119615 -0.923918
C  -3.451307 2.265095 0.920367
C  -2.439201 4.510985 1.07514
C  -1.895788 -2.24493 2.307328
C  -1.846945 4.317234 -0.202232
C  -3.240426 3.473528 1.621076
C  -0.568565 -2.718718 2.477895
C  5.783102 -2.061747 -2.34596
C  6.919705 -1.423734 0.33874
C  -2.248924 5.817128 1.82419
H  -0.844593 -0.423709 -1.705729
H  3.044029 -1.844182 -2.352057
H  2.490379 -0.697672 1.791141
H  -3.298908 -1.199073 1.020277
H  1.417998 -2.781375 1.623483
H  4.957814 -0.77547 2.132664
H  -1.605282 2.969379 -1.917447
H  -4.089185 1.470582 1.320058
H  -1.231518 5.11212 -0.638648
H  -3.709276 3.612326 2.60195
H  -2.666186 -2.503092 3.042864
H  -0.310101 -3.349259 3.334106
H  5.201139 -2.248471 -3.263613
H  6.510932 -1.256852 -2.564664
H  6.373346 -2.97255 -2.127436
H  7.33675 -2.429644 0.138904
H  7.454229 -0.722798 -0.330996
H  7.167729 -1.154456 1.37906
H  -2.296536 5.669975 2.917031
H  -1.279802 6.286501 1.582141
H  -3.041495 6.542026 1.555212
