program: Gaussian 09
title: 000266880
version: EM64L-G09RevD.01
frameworkgroup: C1[X(C21H27NO6S)]
method: RPBEPBE
basis: SDD
operation: Freq
keyword: #p
keyword: freq=noraman
keyword: PBEPBE/SDD
title: #p freq=noraman PBEPBE/SDD
converged: YES YES NO NO
title: Mulliken charges:
elementType: S O O O O O O N C C C C C C C C C C C C C C C C C C C C C H H H H H H H H H H H H H H H H H H H H H H H H H H H
charge: 0.888096 -0.528435 -0.530017 -0.240368 -0.257908 -0.231216 -0.261642 -0.408310 -0.464081 -0.376226 0.372145 -0.020213 -0.528206 -0.473038 -0.305089 -0.255046 -0.239510 0.236365 -0.350294 0.276668 0.200594 0.447351 -0.360406 -0.375889 -0.800401 -0.258832 -0.538029 -0.538473 -0.667790 0.296348 0.239741 0.228034 0.226261 0.278644 0.241502 0.273953 0.265968 0.280890 0.288494 0.246834 0.242092 0.242448 0.244025 0.227925 0.229371 0.224743 0.237283 0.222311 0.223831 0.247290 0.249492 0.223285 0.222795 0.213582 0.223935 0.247122
chargesum: 0.00000
title: Mulliken charges with hydrogens summed into heavy atoms:
elementType: S O O O O O O N C C C C C C C C C C C C C C C C C C C C C
charge: 0.888096 -0.528435 -0.530017 -0.240368 -0.257908 -0.231216 -0.261642 -0.408310 0.072008 0.078069 0.372145 -0.020213 -0.008061 -0.199084 -0.039121 0.025843 0.048984 0.236365 -0.103460 0.276668 0.200594 0.447351 -0.118314 -0.133441 -0.099080 0.203194 0.155403 0.157099 0.016850
polarizability: 3.53179931e+02 6.85675884e+00 2.94676333e+02 5.31969780e+00 2.55479663e+01 2.34622577e+02
1716.lowfreq: -4.9605 -0.0015 -0.0010 -0.0009 5.7033 6.8046 13.4809 17.8327 20.0615
frequency: 11.8403 17.4038 20.0280 26.0470 33.8151 39.5101 44.2564 47.6527 50.0053 63.9014 84.7253 89.7522 94.1259 104.0364 113.9882 131.6319 141.8769 159.5886 168.0890 183.8562 190.3086 202.1233 209.6683 225.9749 232.9801 240.3100 258.4936 262.6542 278.2776 293.6803 305.0421 310.8695 333.6343 355.4091 363.1981 380.3803 386.4490 391.7744 407.4970 422.5614 426.8478 454.3923 470.7999 473.3371 506.7526 515.5686 553.0324 563.9564 588.7270 595.1373 623.2814 629.9388 650.9481 689.0179 707.4147 732.4587 743.9210 763.4821 776.1285 793.6132 803.4279 809.4571 817.9345 828.0071 831.7629 851.3135 872.3881 888.4832 893.9350 913.7006 930.5508 960.8360 965.1913 981.1563 981.6929 989.7738 996.1053 997.2268 1014.2779 1037.2164 1048.8127 1048.9562 1058.1586 1095.1527 1098.4092 1112.1722 1113.4863 1118.8950 1131.7645 1142.9292 1146.6187 1158.6393 1158.8627 1176.6086 1184.7812 1189.0576 1211.9525 1218.1561 1229.9416 1262.7970 1271.1596 1277.9924 1288.8686 1297.9018 1338.6238 1352.3499 1356.3738 1367.2045 1370.6502 1382.3503 1388.2348 1392.6876 1399.1690 1412.4322 1435.7375 1441.3008 1448.6082 1455.5305 1458.3152 1460.4180 1463.4324 1467.4310 1468.7930 1470.3499 1471.6000 1472.1904 1474.4185 1475.8477 1485.0357 1497.8372 1574.2092 1592.7147 1596.6416 1597.1124 1635.9449 2958.7138 2961.9981 2980.0351 2983.9083 2984.7715 2989.8359 3001.8676 3033.2723 3036.9851 3046.6607 3050.5401 3051.2004 3061.9643 3062.7688 3084.5145 3091.2220 3092.6030 3119.6315 3127.6738 3129.7645 3133.3140 3135.8734 3157.8093 3162.7235 3165.6487 3176.2110 3186.0340
redmass: 4.5024 4.5981 4.8245 4.5309 3.5565 3.3084 5.4302 1.8384 1.6028 6.7731 4.8099 3.5075 4.2414 4.9186 3.8110 5.4149 4.9423 4.6048 3.5410 2.9914 3.4794 1.6344 5.0732 2.9786 2.5368 1.7419 2.9141 1.5128 2.1804 4.6304 2.7699 3.8007 3.2187 3.5653 3.3272 3.6931 4.5273 5.5330 2.8724 4.2065 5.2841 6.5035 3.1794 3.1244 2.9724 4.0091 3.9348 4.4596 4.3223 5.0770 6.9558 3.8331 4.5156 4.8199 3.2850 5.0577 2.9122 2.0977 5.5568 4.7026 1.8786 1.5848 2.4054 1.4184 2.6511 1.2498 1.8248 3.0000 2.3721 7.1464 1.5316 1.3534 2.6855 7.6451 1.3883 1.5215 3.9164 3.9665 2.7998 2.1771 1.8166 2.0891 2.4940 2.2776 3.2837 1.2605 1.2612 1.2827 1.9814 2.6650 1.5971 1.4166 1.6641 1.6654 1.1398 1.2223 2.0406 2.9928 1.5139 3.0100 1.7583 1.1223 1.1807 1.2607 1.3178 1.2452 1.4058 2.0742 2.5843 6.5230 1.2412 2.8551 1.2345 3.3876 1.1919 1.2730 1.1193 1.1015 1.0932 1.0739 1.0457 1.0502 1.0499 1.1172 1.0785 1.0655 1.0892 2.2907 1.0521 2.4822 7.9970 6.4169 6.8479 6.1896 8.1751 1.0330 1.0329 1.0387 1.0627 1.0617 1.0360 1.0634 1.0597 1.0980 1.1039 1.1000 1.1040 1.0951 1.0993 1.0971 1.0999 1.1026 1.1067 1.0994 1.0995 1.0893 1.0896 1.0882 1.0952 1.0964 1.0907 1.0952
irintensity: 0.4222 0.5234 0.3688 1.0810 0.0178 0.2495 0.7308 1.1280 0.2346 1.4764 0.2158 9.3449 2.3198 6.2913 1.7237 1.4952 2.0748 3.1597 5.6907 3.4000 1.1227 1.4079 5.9279 10.1278 3.9628 4.4783 5.1538 0.8799 5.7393 5.8674 6.2718 4.6744 26.2780 1.2419 4.1394 1.2010 6.5979 11.6431 0.2646 1.2653 45.4232 28.3499 3.4859 18.4506 46.2924 23.6607 22.2472 5.5528 5.2112 54.4562 0.3922 13.6945 6.1009 3.2668 0.7977 21.5826 0.6227 20.0432 22.6085 99.0742 14.3152 19.9375 1.2741 33.8704 2.4315 2.0296 14.5965 40.8882 14.2537 50.5022 6.6265 1.2691 14.0344 40.9241 0.7748 0.7890 6.9577 32.4350 60.2176 51.9947 18.4153 6.9581 24.4916 56.1880 56.9915 0.0732 0.2580 7.8931 134.1635 206.4158 47.8988 2.5586 50.8370 73.6752 14.7378 1.5178 76.8387 6.2755 27.3435 217.4830 18.3936 7.2093 12.0629 2.6954 23.3322 8.6902 0.7400 20.7986 34.5592 1.2121 21.3481 8.8119 15.6883 11.2291 31.1359 1.6745 33.2315 13.2602 33.6176 8.7645 11.2845 13.2787 17.0363 99.6461 7.4317 39.7384 18.0353 24.9653 11.6276 157.1010 30.0563 75.2336 1.3324 9.3211 120.4166 65.0967 59.7375 27.8413 33.8894 9.6263 26.7022 32.1477 22.5577 3.2425 39.5748 6.2921 46.3491 16.4963 12.5699 36.8350 14.9309 2.7338 31.3075 21.4233 25.0530 14.2368 9.0531 11.7324 0.6306 9.1122 3.1124 0.9454
temp: 298.150 k
press: 1.00000 atm
elementType: 16 8 8 8 8 8 8 7 6 6 6 6 6 6 6 6 6 6 6 6 6 6 6 6 6 6 6 6 6 1 1 1 1 1 1 1 1 1 1 1 1 1 1 1 1 1 1 1 1 1 1 1 1 1 1 1
symmnumber: 1
zpe: 1163450.7 jmol-1
zpe.correction: 0.443135 hartree
zpe.thermalcorrener: 0.474963 hartree
zpe.thermalcorrenthalpy: 0.475907 hartree
zpe.thermalcorrgfe: 0.375310 hartree
zpe.sumelectzpe: -1718.202379 hartree
zpe.sumelectthermal: -1718.170551 hartree
zpe.sumelectthermalent: -1718.169607 hartree
zpe.sumelectthermalfe: -1718.270205 hartree
dipole: -5.5087 0.0187 -0.2282
dipole: 5.5134
quadrupole: -170.0693 -154.9514 -173.5705
quadrupole: -13.0823 -3.4320 11.6803
quadrupole: -3.8723 11.2457 -7.3734 -13.0823 -3.4320 11.6803
hfenergy: -1718.6455145 hartree
pointgroup: C01 [X(C21H27N1O6S1)]
dipole: 2.1682542 -0.0342141 0.0520151 debye
polarizability: 353.5400518|7.7340323|297.4942279|2.8084145|-20.9596099|231.4445603 unknown
InChI: InChI=1S/C21H27NO6S/c1-5-28-21(23)7-6-14-22(17-10-13-19(26-3)20(15-17)27-4)29(24,25)18-11-8-16(2)9-12-18/h8-13,15H,5-7,14H2,1-4H3
charge 0 multiplicity 1
56 atoms
S  -0.964301 -1.08105 -0.397119
O  -1.03091 -0.403571 -1.890538
O  -2.262543 -1.873336 0.195362
O  4.250319 1.409554 1.676653
O  -4.994073 0.392534 -1.079175
O  4.147561 3.235103 -0.238109
O  -4.880378 0.573476 1.243696
N  -0.45567 0.16124 0.997523
C  -1.652642 0.734393 1.684233
C  -2.359387 1.9733 1.081993
C  0.652945 0.993559 0.610556
C  0.520611 -2.233536 -0.391411
C  -3.195702 1.69766 -0.185589
C  1.872257 0.778522 1.314122
C  0.60787 1.96182 -0.421129
C  0.590384 -3.226838 0.598981
C  1.481236 -2.080188 -1.401544
C  3.019657 1.540965 1.026313
C  1.760713 2.718837 -0.726767
C  -4.42119 0.841534 0.107268
C  2.965024 2.530403 -0.011862
C  2.702087 -3.990187 -0.426438
C  1.695068 -4.105147 0.570706
C  2.579057 -2.969986 -1.405602
C  3.865421 -4.964656 -0.461946
C  -6.178654 -0.509962 -0.952607
C  4.339171 0.394428 2.729325
C  4.135379 4.248472 -1.297472
C  -7.47509 0.301198 -0.866488
H  -2.376279 -0.09225 1.807844
H  -1.282836 0.991333 2.696833
H  -1.620222 2.769453 0.877725
H  -3.036682 2.355702 1.869695
H  -2.613394 1.207799 -0.989283
H  -3.556942 2.653772 -0.614421
H  1.88016 0.00356 2.08489
H  -0.302214 2.095012 -1.010708
H  -0.200005 -3.31886 1.350556
H  1.361166 -1.302206 -2.162205
H  1.713781 3.455335 -1.533988
H  1.773656 -4.892794 1.329276
H  3.346899 -2.870312 -2.181283
H  3.578737 -5.898244 -0.983596
H  4.190701 -5.246811 0.55491
H  4.733619 -4.542231 -0.996113
H  -6.132316 -1.124391 -1.86575
H  -6.038064 -1.144182 -0.06026
H  3.630806 0.606939 3.553823
H  4.146428 -0.61963 2.327567
H  5.372368 0.459536 3.099936
H  5.151262 4.668964 -1.297225
H  3.399103 5.046915 -1.081858
H  3.916794 3.796144 -2.284217
H  -8.344309 -0.38295 -0.859753
H  -7.575099 0.977165 -1.733582
H  -7.500341 0.899588 0.059754
