program: Gaussian 09
title: 000266879
version: EM64L-G09RevD.01
frameworkgroup: C1[X(C21H25NO6S)]
method: RPBEPBE
basis: SDD
operation: Freq
keyword: #p
keyword: freq=noraman
keyword: PBEPBE/SDD
title: #p freq=noraman PBEPBE/SDD
converged: YES YES NO NO
title: Mulliken charges:
elementType: S O O O O O O N C C C C C C C C C C C C C C C C C C C C C H H H H H H H H H H H H H H H H H H H H H H H H H
charge: 0.951640 -0.514892 -0.517894 -0.260310 -0.276585 -0.269865 -0.232031 -0.391983 -0.425428 -0.384708 0.269177 -0.066379 -0.528392 0.211645 -0.304731 -0.244545 -0.228795 -0.347783 0.275412 -0.240312 0.447716 -0.368865 -0.375328 -0.238240 0.176948 -0.799092 -0.262615 -0.667162 -0.504008 0.291415 0.198323 0.222637 0.221972 0.239936 0.331854 0.236105 0.287479 0.289419 0.270683 0.231724 0.244771 0.244457 0.235484 0.229156 0.230407 0.245013 0.223053 0.235952 0.224883 0.247442 0.213536 0.236872 0.257672 0.227162
chargesum: 0.00000
title: Mulliken charges with hydrogens summed into heavy atoms:
elementType: S O O O O O O N C C C C C C C C C C C C C C C C C C C C C
charge: 0.951640 -0.514892 -0.517894 -0.260310 -0.276585 -0.269865 -0.232031 -0.391983 0.064309 0.059901 0.269177 -0.066379 0.043398 0.211645 -0.068626 0.042934 0.060624 -0.077100 0.275412 -0.008588 0.447716 -0.124094 -0.130871 -0.002756 0.176948 -0.094517 0.196389 0.018700 0.217699
polarizability: 3.20513290e+02 5.45134300e+00 3.18023504e+02 -3.20198104e+01 3.83393536e+00 2.34115952e+02
1716.lowfreq: -11.4376 -7.1644 -5.0710 -0.0007 0.0006 0.0012 8.6768 9.9986 18.3588
frequency: 7.3239 9.6403 18.1684 21.3520 25.8727 34.5993 37.0757 40.0200 59.0397 65.9993 67.2796 83.8069 89.4048 97.7295 109.5713 112.5676 124.5318 136.2136 154.5647 177.9305 195.4094 204.4576 213.7224 223.1070 232.3059 250.4198 268.4389 282.1971 302.3359 315.6489 319.3292 327.4849 344.7571 370.2069 388.1886 394.8842 397.6210 406.9341 425.4768 439.2035 450.3106 480.4564 502.0621 540.2511 544.8287 562.6505 578.9738 596.3945 621.0919 635.7201 641.2139 675.1376 706.9018 738.6893 764.1198 770.1070 774.4330 775.5751 784.5108 807.9049 814.7902 825.5579 831.8561 848.6540 863.5074 879.5867 908.4836 918.5540 947.4724 958.0241 962.1864 964.4483 980.9766 990.1890 992.7290 993.1622 1014.6539 1027.5919 1041.1168 1047.4543 1049.3182 1055.3413 1065.8709 1094.4987 1095.8581 1114.0883 1119.3114 1130.6940 1146.7327 1150.4454 1156.0757 1175.0584 1183.4399 1185.8374 1212.5951 1217.9967 1231.0852 1262.9378 1269.6025 1278.5161 1280.1252 1296.9386 1340.3246 1350.0022 1355.9940 1371.0811 1372.0356 1379.3513 1389.4389 1390.3707 1399.5661 1419.7566 1426.6340 1442.4557 1450.7215 1451.6118 1456.5842 1463.0378 1463.7239 1470.8383 1471.2087 1471.3948 1473.4028 1485.9675 1497.6855 1571.0323 1589.8518 1591.5849 1593.1430 1625.7533 1630.8388 2940.4211 2980.7586 2990.2412 2992.4797 3001.9320 3003.7000 3029.8332 3046.3961 3051.6618 3063.1527 3065.5222 3085.0501 3091.3445 3092.0070 3107.6423 3117.6876 3131.5712 3134.8372 3137.0435 3146.5261 3149.5095 3160.0241 3162.0528 3164.6951 3175.9932
redmass: 3.9060 3.5502 1.2124 4.5264 4.6571 4.2761 4.3736 4.4264 4.4121 4.6736 5.4799 5.2851 3.2333 3.3496 3.6774 1.4901 4.9783 5.1459 4.7986 3.5089 2.2546 2.9011 6.8631 4.6806 5.9361 1.6991 4.5608 5.0024 4.5096 4.6360 3.7877 3.5734 3.5540 4.6002 5.0522 3.4476 6.1602 2.8708 7.7346 4.0864 3.5009 2.4513 3.1505 4.6613 3.9973 3.2923 5.8617 4.3031 6.9558 4.1334 5.8139 5.0037 3.2823 4.0202 2.6691 2.9672 1.5619 4.8385 3.3165 11.0580 1.6307 1.3740 2.3431 1.2457 2.8421 1.4960 2.3465 6.6289 7.9143 2.1666 1.3181 1.6206 1.4019 1.5959 3.6551 1.3810 2.8746 3.1372 3.6760 2.4564 1.5968 2.7777 1.9090 2.4946 2.9114 1.2781 1.2937 1.7209 3.0445 1.4686 1.7155 1.0752 1.1808 1.1698 1.4290 3.0197 3.6212 2.4113 1.6240 1.1610 1.1427 1.2643 1.3200 1.2842 1.3409 2.5514 2.9592 6.1390 1.2427 2.9864 1.2214 1.2859 1.8844 1.0976 1.0492 1.0922 1.0912 1.0430 1.0517 2.4104 1.6074 1.4152 1.0639 1.0508 1.0891 6.7560 6.1280 6.8511 5.9725 9.3512 8.3517 1.0668 1.0388 1.0363 1.0610 1.0619 1.0294 1.0595 1.0969 1.0960 1.0950 1.1004 1.0972 1.1029 1.1001 1.1045 1.1063 1.0859 1.0890 1.0894 1.1049 1.0901 1.0957 1.0952 1.0966 1.0981
irintensity: 0.3545 1.4873 1.6284 0.0332 0.4109 0.7954 0.8957 0.0402 0.9920 0.8870 0.5812 1.2687 0.4509 0.3713 4.8726 0.2302 1.0534 0.2591 1.7687 18.0602 2.6159 2.9974 1.1991 5.8579 7.3646 1.5401 0.8851 3.7092 17.2238 2.5462 6.2602 21.4521 6.1937 2.1826 1.3629 15.3179 12.3583 0.1317 77.7242 2.4205 24.0559 0.1992 76.0200 9.4400 16.8709 4.6504 20.3586 0.6251 0.3093 4.9922 3.6222 42.8082 1.5713 1.8871 28.0156 1.1508 41.4486 2.6324 10.9261 78.0034 11.8422 20.8883 10.2381 1.1827 21.0916 3.2840 20.2210 3.3891 41.6902 10.5296 1.0283 7.3267 0.9385 1.4357 4.4884 0.5168 55.9749 11.4225 72.4239 23.2580 20.5834 143.2116 8.4954 86.3583 23.5198 1.2316 9.9114 46.3109 263.0531 44.0943 41.7310 1.8391 15.8439 3.9002 15.8279 8.0668 184.5410 28.4097 10.6215 3.8388 13.8781 2.5530 28.0183 5.5842 9.2018 25.4293 39.0315 0.1664 21.4759 9.3177 15.6420 22.4099 11.6584 41.6314 11.4245 9.9379 10.4528 13.2701 9.9466 24.7966 50.2225 13.0851 14.2976 10.9284 20.5310 12.1093 13.4670 0.2922 9.9200 135.5493 147.0361 47.4222 26.7446 34.1550 43.8475 40.0943 39.4801 25.1457 17.7768 1.4128 16.8360 8.0085 36.8063 1.4435 14.2481 20.9138 34.1817 2.9817 12.3967 8.5418 18.3779 13.1149 3.4401 13.8579 8.0336 14.2892
temp: 298.150 k
press: 1.00000 atm
elementType: 16 8 8 8 8 8 8 7 6 6 6 6 6 6 6 6 6 6 6 6 6 6 6 6 6 6 6 6 6 1 1 1 1 1 1 1 1 1 1 1 1 1 1 1 1 1 1 1 1 1 1 1 1 1
symmnumber: 1
zpe: 1104912.8 jmol-1
zpe.correction: 0.420839 hartree
zpe.thermalcorrener: 0.452156 hartree
zpe.thermalcorrenthalpy: 0.453100 hartree
zpe.thermalcorrgfe: 0.351212 hartree
zpe.sumelectzpe: -1717.065912 hartree
zpe.sumelectthermal: -1717.034595 hartree
zpe.sumelectthermalent: -1717.033651 hartree
zpe.sumelectthermalfe: -1717.135539 hartree
dipole: -5.2210 -0.2456 3.2312
dipole: 6.1449
quadrupole: -146.6733 -161.8612 -174.4791
quadrupole: 8.1081 -8.9442 -1.4519
quadrupole: 14.3312 -0.8567 -13.4746 8.1081 -8.9442 -1.4519
hfenergy: -1717.4867513 hartree
pointgroup: C01 [X(C21H25N1O6S1)]
dipole: 1.6255915 -1.3780683 1.1415737 debye
polarizability: 324.6667558|-2.5350472|317.6940671|22.2071158|-14.9299832|230.291924 unknown
InChI: InChI=1S/C21H25NO6S/c1-4-28-20(23)10-7-15-22(19-9-6-5-8-18(19)21(24)27-3)29(25,26)17-13-11-16(2)12-14-17/h5-6,8-9,11-14H,4,7,10,15H2,1-3H3
charge 0 multiplicity 1
54 atoms
S  0.673783 0.236169 -1.200251
O  0.58008 1.820461 -1.546148
O  0.097721 -0.921909 -2.186003
O  -3.236746 3.773627 0.183514
O  -2.408614 -2.717886 -1.846042
O  -1.146761 4.061186 1.176198
O  -2.850403 -0.664714 -0.846415
N  -0.296301 0.022095 0.477767
C  0.043542 1.10275 1.430389
C  -1.199077 1.417673 2.301081
C  -0.38612 -1.33598 0.890882
C  2.487523 -0.172372 -0.865428
C  -2.385623 1.934401 1.464831
C  -1.251847 -2.232008 0.180155
C  0.374394 -1.839599 1.985433
C  3.353327 0.879895 -0.523033
C  2.89944 -1.51072 -0.975457
C  -1.279073 -3.602073 0.540265
C  -2.155754 3.346456 0.953969
C  0.294483 -3.19377 2.363045
C  5.177458 -0.776258 -0.370776
C  4.706572 0.561201 -0.275981
C  4.258257 -1.800957 -0.721589
C  -0.519702 -4.085821 1.626281
C  -2.21437 -1.74423 -0.862779
C  6.642973 -1.095922 -0.139926
C  -3.133454 5.138595 -0.417438
C  -3.634649 6.204652 0.56176
C  -3.29936 -2.313372 -2.95779
H  0.28752 2.004657 0.841036
H  0.918098 0.868911 2.074742
H  -0.89519 2.178253 3.045123
H  -1.50694 0.50933 2.851914
H  -3.319236 1.936863 2.0591
H  -2.569827 1.261326 0.605024
H  1.03638 -1.164598 2.536842
H  2.985349 1.910358 -0.480722
H  2.189012 -2.288376 -1.273149
H  -1.923095 -4.276777 -0.030607
H  0.880272 -3.556551 3.21499
H  5.406453 1.363103 -0.014067
H  4.608482 -2.836226 -0.803877
H  -0.570208 -5.144541 1.901223
H  6.785367 -2.139594 0.189148
H  7.089136 -0.431132 0.620123
H  7.223997 -0.9628 -1.073039
H  -3.765736 5.072525 -1.317247
H  -2.0819 5.316879 -0.702601
H  -4.664663 5.983035 0.891353
H  -2.978898 6.260546 1.44688
H  -3.634904 7.194862 0.068691
H  -4.306653 -2.069028 -2.579634
H  -2.874721 -1.431395 -3.465156
H  -3.324093 -3.183996 -3.628205
