program: Gaussian 09
title: 000266878
version: EM64L-G09RevD.01
frameworkgroup: C1[X(C21H21NO6S)]
method: RPBEPBE
basis: SDD
operation: Freq
keyword: #p
keyword: freq=noraman
keyword: PBEPBE/SDD
title: #p freq=noraman PBEPBE/SDD
converged: YES YES NO NO
title: Mulliken charges:
elementType: S O O O O O O N C C C C C C C C C C C C C C C C C C C C C H H H H H H H H H H H H H H H H H H H H H
charge: 0.921069 -0.303595 -0.291853 -0.522254 -0.529166 -0.191966 -0.188415 -0.203562 -0.427620 -0.629022 0.371406 0.240576 0.149216 0.196183 -0.114002 -0.433106 -0.344176 -0.231333 -0.240255 -0.191899 -0.250876 -0.362336 -0.379380 0.449744 0.281052 -0.800561 0.276958 -0.757058 -0.756385 0.271233 0.251980 0.223445 0.264893 0.240623 0.253905 0.232537 0.283430 0.280970 0.231670 0.242344 0.241780 0.228787 0.228566 0.245201 0.289756 0.240222 0.244461 0.258951 0.249876 0.257984
chargesum: 0.00000
title: Mulliken charges with hydrogens summed into heavy atoms:
elementType: S O O O O O O N C C C C C C C C C C C C C C C C C C C C C
charge: 0.921069 -0.303595 -0.291853 -0.522254 -0.529166 -0.191966 -0.188415 -0.203562 0.095593 -0.140684 0.371406 0.240576 0.149216 0.196183 -0.114002 -0.192484 -0.090271 0.001205 0.043175 0.089071 -0.019207 -0.119992 -0.137600 0.449744 0.281052 -0.098006 0.276958 0.017381 0.010426
polarizability: 3.00865273e+02 2.82979216e+01 3.30836683e+02 9.53978130e+00 -4.09343025e+00 2.87235902e+02
1716.lowfreq: -59.1788 -8.5268 -0.0015 -0.0013 -0.0010 1.7850 3.8033 11.4646 17.6652
frequency: -59.1766 8.0553 17.3632 24.6868 33.4637 38.6597 42.5291 43.6672 49.8874 56.2547 64.6731 71.3431 87.7399 96.6449 110.0114 125.1601 133.6232 161.5816 164.2641 172.7230 190.5037 219.2554 234.0273 240.2283 261.9848 276.3730 277.7924 303.3507 311.1605 359.9636 367.9385 375.2264 382.4495 400.5428 404.0201 410.8507 437.0194 464.5152 496.9412 500.3326 515.2932 534.1366 547.3279 560.8717 564.1499 577.6066 589.3434 618.0236 620.5186 639.3842 693.0089 703.7163 710.1311 747.6091 766.9210 775.8551 777.6886 787.4419 789.9164 799.0306 818.7687 841.9894 873.9589 884.2160 910.7853 918.0697 955.7300 956.2301 967.7632 978.0508 980.4373 987.9186 989.2321 989.9288 991.8447 1001.6366 1036.3301 1043.2087 1045.3900 1046.4591 1048.1339 1049.4414 1061.4394 1116.3054 1120.9993 1143.6646 1153.9685 1176.7674 1186.9367 1196.8085 1210.2871 1218.2836 1232.0952 1263.8486 1293.1295 1298.6629 1318.7991 1335.2668 1376.5561 1379.5282 1379.9604 1382.0506 1384.0101 1390.8948 1398.4432 1435.1677 1449.2148 1452.6020 1456.6703 1457.3112 1462.0297 1471.1905 1471.7817 1473.2987 1474.7077 1483.8165 1537.4817 1579.8130 1590.3709 1592.8940 1605.5485 1682.8437 1698.0735 2944.1038 2979.7480 2985.6301 2994.0748 3009.6292 3014.4342 3052.4233 3062.0628 3088.1103 3090.9271 3097.3429 3125.5259 3135.0358 3135.2458 3137.1517 3141.6712 3142.9799 3148.9064 3162.2531 3165.6697 3175.1615
redmass: 1.0960 4.6158 5.0824 4.6234 6.7370 3.5939 1.3640 3.2214 6.7287 5.0580 4.1612 3.5007 5.4158 5.7024 5.5092 5.8499 7.1331 1.0410 6.4209 5.2284 4.7340 7.9945 4.4346 4.2651 4.1287 5.0568 5.2134 4.2068 5.2128 4.8293 3.8149 3.7902 6.4718 4.1618 2.8961 7.3989 4.9375 3.7563 4.0283 3.3403 4.8361 3.8376 4.3537 4.8497 3.5670 5.8413 4.3153 5.2559 6.9251 4.7641 5.5723 3.2690 5.6899 3.6282 1.9647 4.8213 2.4427 4.6816 8.5908 9.5410 1.3592 1.2529 2.6121 1.6009 3.8244 14.2447 1.4070 1.3460 2.7457 1.3884 2.4161 2.2963 1.7211 2.9881 1.3567 3.4822 3.6516 1.6307 1.9680 2.3411 1.6125 2.1386 2.7363 1.9252 1.2981 2.8507 2.8596 1.0826 1.1302 1.2116 2.3684 3.0855 2.1458 1.5902 1.4397 1.2608 2.8092 1.6575 1.6589 3.9086 4.3559 1.2492 1.2192 3.0972 1.2204 2.2851 1.0493 1.0589 1.0543 1.0485 1.1201 1.1365 2.1168 1.0590 1.1616 2.6981 8.5875 6.8851 6.7474 6.0307 6.2123 11.5739 10.6031 1.0657 1.0388 1.0626 1.0390 1.0367 1.0943 1.0997 1.0949 1.0943 1.1001 1.0970 1.0861 1.0893 1.0887 1.0900 1.1015 1.1013 1.0941 1.0957 1.1007 1.0951
irintensity: 1.1089 0.3599 0.1321 0.4423 0.1660 1.1240 0.1741 0.5940 2.9460 1.7616 2.6486 8.1955 0.6987 9.3523 1.8179 1.8408 6.0646 0.5301 10.6525 4.0996 6.8511 8.6678 0.1649 6.1322 4.0077 5.6810 4.6575 2.5468 4.5688 1.1700 14.2096 0.9825 7.1514 5.7943 0.3139 59.0683 5.3829 14.6184 45.2713 45.1708 7.3420 7.5096 8.3933 8.6348 6.4132 20.1870 5.1659 0.6379 0.4581 19.4997 14.9340 0.9750 9.5563 3.8346 115.0075 7.5343 36.0785 38.4939 170.0301 11.3106 22.8022 2.5112 34.0031 13.0838 101.6604 99.1404 2.4985 0.5935 22.3935 1.3949 123.6777 88.6771 1.8194 1.0496 0.4972 155.2125 193.3719 4.2588 13.8053 34.1281 20.8771 19.0210 42.4362 95.8268 7.4242 502.9005 288.9163 3.5390 11.4907 2.1731 13.0798 5.9406 37.8708 21.4480 3.7807 2.2633 12.6839 6.2628 2.5627 1.2037 0.5502 72.1198 60.9200 10.6998 17.8171 3.3192 19.6856 11.4641 14.7678 23.9664 23.8870 14.7826 20.2684 10.8181 32.3547 11.8848 60.7707 7.9413 0.4733 14.4640 6.0347 126.8277 221.8547 4.6799 24.6753 9.9478 2.8133 1.8348 38.5436 17.8044 13.9969 3.9230 14.0967 3.3399 3.0451 11.4357 5.4872 8.9529 13.7876 6.3658 19.1289 4.9506 29.8090 4.3301
temp: 298.150 k
press: 1.00000 atm
elementType: 16 8 8 8 8 8 8 7 6 6 6 6 6 6 6 6 6 6 6 6 6 6 6 6 6 6 6 6 6 1 1 1 1 1 1 1 1 1 1 1 1 1 1 1 1 1 1 1 1 1
symmnumber: 1
zpe: 982325.0 jmol-1
zpe.correction: 0.374148 hartree
zpe.thermalcorrener: 0.403388 hartree
zpe.thermalcorrenthalpy: 0.404332 hartree
zpe.thermalcorrgfe: 0.309080 hartree
zpe.sumelectzpe: -1714.712284 hartree
zpe.sumelectthermal: -1714.683044 hartree
zpe.sumelectthermalent: -1714.682100 hartree
zpe.sumelectthermalfe: -1714.777352 hartree
dipole: -0.3852 -6.7192 5.0362
dipole: 8.4059
quadrupole: -190.5332 -167.2946 -155.6424
quadrupole: -4.7556 12.7939 7.2390
quadrupole: -19.3765 3.8621 15.5143 -4.7556 12.7939 7.2390
hfenergy: -1715.086432 hartree
pointgroup: C01 [X(C21H21N1O6S1)]
dipole: -1.2332811 2.0451744 2.2876816 debye
polarizability: 282.193144|-7.1938423|346.9647302|-9.8468123|1.8712286|289.7799848 unknown
InChI: InChI=1S/C14H14NO4.C7H7O2S/c1-9(16)18-13-12-6-4-3-5-11(12)7-8-15-14(13)19-10(2)17;1-6-2-4-7(5-3-6)10(8)9/h3-6H,7-8H2,1-2H3;2-5H,1H3
charge 0 multiplicity 1
50 atoms
S  -1.023164 -2.185656 -1.539217
O  1.470122 -1.641777 0.523137
O  1.502366 0.883827 1.436852
O  -0.68558 -3.721656 -1.108206
O  -1.796882 -1.851086 -2.949014
O  3.474912 -2.216394 -0.566888
O  3.265754 2.262795 0.715257
N  0.872962 -1.092608 -1.653427
C  0.873613 -0.328713 -2.921197
C  1.401191 1.118005 -2.821247
C  0.54565 2.046664 -1.979227
C  0.434828 1.843956 -0.568686
C  1.161899 -0.601309 -0.414492
C  1.053582 0.687992 0.09752
C  -2.031552 -1.387751 -0.152647
C  -0.091973 3.168288 -2.555356
C  -0.288043 2.780012 0.223596
C  -0.825511 4.085107 -1.76721
C  -2.96746 -0.400326 -0.502423
C  -1.811541 -1.811618 1.168198
C  -0.91788 3.890927 -0.369682
C  -3.727293 0.181431 0.534933
C  -2.583629 -1.211103 2.186759
C  -3.54878 -0.212845 1.888223
C  2.545063 -2.542462 0.18433
C  -4.395722 0.398832 2.989021
C  2.632585 1.74496 1.648425
C  2.321251 -3.859149 0.879277
C  2.906469 1.870997 3.127552
H  -0.15375 -0.350164 -3.346065
H  1.510475 -0.901189 -3.622634
H  1.475499 1.510794 -3.851851
H  2.429145 1.089852 -2.408103
H  0.002852 3.3362 -3.634581
H  -0.36801 2.612179 1.30296
H  -1.309098 4.947809 -2.238375
H  -3.107258 -0.11504 -1.550003
H  -1.06764 -2.582342 1.388595
H  -1.476827 4.599494 0.2509
H  -4.469855 0.949047 0.288437
H  -2.431487 -1.522291 3.226606
H  -3.863332 0.405602 3.955927
H  -4.687709 1.435892 2.74867
H  -5.329019 -0.17957 3.132206
H  1.486621 -4.374101 0.366239
H  2.020727 -3.701046 1.928535
H  3.229101 -4.477119 0.8272
H  2.129241 1.372564 3.723313
H  2.970085 2.938674 3.398659
H  3.887703 1.416814 3.352104
