program: Gaussian 09
title: 000266876
version: EM64L-G09RevD.01
frameworkgroup: C1[X(C21H16BrNO3S)]
method: RPBEPBE
basis: SDD
operation: Freq
keyword: #p
keyword: freq=noraman
keyword: PBEPBE/SDD
title: #p freq=noraman PBEPBE/SDD
converged: YES YES NO NO
title: Mulliken charges:
elementType: Br S O O O N C C C C C C C C C C C C C C C C C C C C C H H H H H H H H H H H H H H H H
charge: -0.113522 0.951658 -0.505536 -0.499397 -0.141367 -0.431124 0.277328 -0.544320 0.267552 0.286181 0.169961 0.121055 -0.061029 -0.303837 -0.391144 -0.389574 -0.346127 -0.244404 -0.247853 -0.248098 -0.204905 -0.234078 -0.236166 0.448376 -0.397432 -0.338065 -0.797686 0.358156 0.268118 0.253885 0.252587 0.269845 0.238448 0.296685 0.293223 0.235956 0.236176 0.240780 0.248380 0.249724 0.237964 0.229456 0.244171
chargesum: 0.00000
title: Mulliken charges with hydrogens summed into heavy atoms:
elementType: Br S O O O N C C C C C C C C C C C C C C C C C C C C C
charge: -0.113522 0.951658 -0.505536 -0.499397 -0.141367 -0.431124 0.277328 -0.186164 0.267552 0.286181 0.169961 0.121055 -0.061029 -0.035719 -0.137259 -0.136987 -0.076282 -0.005956 -0.011897 0.048587 0.088317 0.002098 0.004614 0.448376 -0.149053 -0.088341 -0.086095
polarizability: 4.03335771e+02 8.17335604e+00 2.98443376e+02 4.43395091e+01 -1.09695890e+01 2.19143110e+02
1716.lowfreq: -7.5635 -4.0928 -0.0012 -0.0011 -0.0009 3.9370 16.4354 23.3121 29.7656
frequency: 15.9642 23.0044 29.7335 40.0866 43.8690 49.7537 62.5756 81.5474 100.7105 102.5100 119.8313 126.5151 148.8800 156.0448 166.6682 206.7810 226.4393 230.7260 278.4088 279.9685 295.2078 316.3864 323.2407 348.0734 378.4289 380.6834 398.3837 405.2095 406.9136 428.0245 449.7170 470.1622 499.8310 510.2143 527.8151 561.2843 576.9624 584.0301 597.4495 611.4175 619.9500 646.2267 675.0432 703.0007 730.7352 740.1839 762.0750 774.8312 777.0003 780.1551 792.7655 803.6747 824.3659 829.0721 846.6325 878.6240 890.2683 948.2349 957.8665 961.7296 965.6743 983.5939 986.5928 988.8194 991.9055 994.2496 996.3541 998.2245 1044.1638 1049.0294 1050.0083 1058.6719 1086.8316 1097.5974 1118.8566 1124.0472 1147.3846 1177.3652 1181.0061 1190.2746 1213.4183 1219.9271 1250.6281 1274.8944 1291.4588 1302.9099 1307.6873 1355.9531 1370.0539 1373.6388 1380.5899 1392.5352 1401.2746 1424.0531 1434.1667 1469.5604 1470.1200 1472.5265 1475.2802 1489.6023 1562.4527 1578.0796 1590.5684 1593.1792 1594.4603 1600.6744 1616.5304 2969.5983 2983.6521 3063.6993 3094.2491 3133.8785 3135.7491 3140.2597 3142.0342 3145.4697 3147.7138 3157.7752 3159.8885 3164.6534 3167.3018 3172.6779 3173.5515
redmass: 6.2809 6.1711 9.0929 3.6304 1.2036 4.2644 8.6962 4.9807 5.7821 8.9456 5.6306 4.7911 5.7243 10.1509 8.4011 5.7955 8.0943 10.2593 5.5425 9.1623 4.9186 5.5483 5.7408 5.2544 6.4448 4.5899 6.8858 3.0267 5.4081 5.5780 5.3479 4.9017 4.1745 3.9079 5.3803 3.4627 4.9303 6.0595 5.4360 6.8799 6.9496 5.7595 6.2512 3.3129 4.7258 2.5033 2.2849 4.0759 2.9034 1.6199 3.3729 9.2740 1.3998 4.6484 1.2484 1.4416 1.4687 9.9789 1.4385 1.3227 1.4648 1.5558 2.2192 3.7807 1.6697 3.2630 2.2532 1.4615 2.2973 2.3760 1.6292 2.1612 2.2039 1.3221 1.7555 1.3064 1.9408 1.0634 1.0675 1.1310 2.9032 3.0854 1.7425 1.5298 2.1432 1.2585 1.4128 3.6867 8.9144 7.1032 5.1737 2.7476 1.3128 2.2429 2.3596 2.4753 1.0623 2.1468 1.1436 3.0798 6.2128 7.0204 6.5101 6.1654 7.0167 6.4369 9.4007 1.0808 1.0378 1.0969 1.0993 1.0860 1.0856 1.0894 1.0894 1.0898 1.0895 1.0947 1.0948 1.0956 1.0971 1.1008 1.1004
irintensity: 1.7294 1.5642 0.4503 0.5504 0.3245 0.3999 0.9030 0.9047 3.6068 2.9129 0.1521 0.3411 0.6748 6.9865 5.9828 0.7073 12.0224 0.3250 5.7208 5.8257 9.3431 6.9364 0.8608 3.0248 23.9812 6.4683 27.0119 0.7296 15.1215 82.3650 11.8260 29.0628 45.8488 73.0538 58.3519 2.4373 44.8309 37.5743 11.5520 4.3551 0.3081 32.1729 1.2504 2.0033 2.4285 53.1177 72.8306 1.1841 14.0328 9.2035 4.0967 52.0899 47.3952 36.0056 2.1619 0.9435 2.9055 38.6955 2.6974 1.1721 5.1647 1.1428 3.5927 61.9062 0.6744 6.4506 2.3601 3.8304 3.4229 33.4103 12.6864 5.0204 6.4436 53.2396 12.2487 8.1624 18.2833 0.8303 0.1455 18.7704 95.1501 5.1627 30.4150 0.4538 1.7232 3.2355 63.9671 59.6159 8.7833 28.5195 4.9508 13.7414 15.7542 12.9841 31.3133 37.9058 16.1879 22.1167 17.5911 1.0804 5.2738 0.2581 9.4158 5.9771 69.5194 7.2086 92.4380 39.4142 22.2261 13.3510 15.8377 3.5094 0.8232 10.2596 6.4329 11.8467 0.3143 4.2052 22.9319 0.1401 12.2700 32.6819 10.3714
temp: 298.150 k
press: 1.00000 atm
elementType: 35 16 8 8 8 7 6 6 6 6 6 6 6 6 6 6 6 6 6 6 6 6 6 6 6 6 6 1 1 1 1 1 1 1 1 1 1 1 1 1 1 1 1
symmnumber: 1
zpe: 820583.9 jmol-1
zpe.correction: 0.312544 hartree
zpe.thermalcorrener: 0.337310 hartree
zpe.thermalcorrenthalpy: 0.338254 hartree
zpe.thermalcorrgfe: 0.254710 hartree
zpe.sumelectzpe: -1499.732278 hartree
zpe.sumelectthermal: -1499.707512 hartree
zpe.sumelectthermalent: -1499.706568 hartree
zpe.sumelectthermalfe: -1499.790112 hartree
dipole: 3.4249 -6.0295 1.7344
dipole: 7.1480
quadrupole: -122.1791 -176.7155 -183.0343
quadrupole: 7.9441 11.5394 -14.4017
quadrupole: 38.4638 -16.0725 -22.3913 7.9441 11.5394 -14.4017
hfenergy: -1500.0448222 hartree
pointgroup: C01 [X(C21H16Br1N1O3S1)]
dipole: -1.1822947 -2.2505992 1.2023192 debye
polarizability: 396.1365753|38.0553938|274.0998992|43.0797404|-35.8587109|250.6857826 unknown
InChI: InChI=1S/C21H16BrNO3S/c1-14-10-12-15(13-11-14)27(25,26)23-19-9-5-4-7-17(19)16-6-2-3-8-18(16)20(24)21(23)22/h2-13,21H,1H3
charge 0 multiplicity 1
43 atoms
Br -0.45976 1.40646 -3.108601
S  -1.109187 1.26195 1.04157
O  -1.05985 2.864476 0.74777
O  -0.672704 0.621637 2.466249
O  2.554555 2.0583 -2.54766
N  0.126926 0.564741 -0.307497
C  0.525708 -0.792922 -0.21831
C  0.575012 1.507359 -1.21779
C  1.872467 -1.105448 0.142387
C  2.886078 -0.048491 0.414693
C  3.006541 1.14979 -0.360843
C  2.10074 1.547359 -1.497786
C  -2.816584 0.608442 0.607278
C  -0.417484 -1.818523 -0.477795
C  2.230686 -2.477786 0.222414
C  3.845162 -0.275782 1.440146
C  4.085021 2.044444 -0.119017
C  -0.042639 -3.17179 -0.367694
C  1.288271 -3.499315 -0.016778
C  -3.363575 -0.380441 1.439286
C  -3.481968 1.158018 -0.501774
C  4.88651 0.636824 1.697875
C  5.015718 1.802912 0.907852
C  -5.385198 -0.325425 0.02401
C  -4.663418 -0.841949 1.132157
C  -4.776016 0.674001 -0.784608
C  -6.786853 -0.813041 -0.289915
H  0.255157 2.525674 -0.907629
H  -1.429725 -1.538887 -0.785296
H  3.2681 -2.744338 0.450862
H  3.749183 -1.171765 2.062292
H  4.172738 2.931731 -0.754147
H  -0.771889 -3.961618 -0.575378
H  -2.798169 -0.761868 2.295443
H  -3.011675 1.926583 -1.123123
H  1.595861 -4.548149 0.052214
H  5.592877 0.440065 2.511424
H  5.827448 2.513641 1.093258
H  -5.120434 -1.61091 1.764766
H  -5.319713 1.079479 -1.645336
H  -6.882854 -1.10289 -1.352017
H  -7.065207 -1.682902 0.328102
H  -7.531757 -0.016445 -0.103354
