program: Gaussian 09
title: 000266875
version: EM64L-G09RevD.01
frameworkgroup: C1[X(C21H14N2O)]
method: RPBEPBE
basis: SDD
operation: Freq
keyword: #p
keyword: freq=noraman
keyword: PBEPBE/SDD
title: #p freq=noraman PBEPBE/SDD
converged: NO YES NO NO
title: Mulliken charges:
elementType: O N N C C C C C C C C C C C C C C C C C C C C C H H H H H H H H H H H H H H
charge: -0.271400 0.003626 -0.436344 0.278602 -0.702425 0.182697 0.277887 0.183549 -0.610804 0.399205 -0.397228 -0.398830 -0.425007 -0.396653 -0.087332 0.232773 -0.235922 -0.236015 0.146763 -0.363805 0.119798 -0.370532 -0.245787 -0.226107 0.243184 0.249556 0.278518 0.241126 0.256037 0.242132 0.240439 0.226839 0.227396 0.273516 0.278999 0.347839 0.234752 0.238961
chargesum: 0.00000
title: Mulliken charges with hydrogens summed into heavy atoms:
elementType: O N N C C C C C C C C C C C C C C C C C C C C C
charge: -0.271400 0.003626 -0.088505 0.278602 -0.209685 0.182697 0.277887 0.183549 -0.332286 0.399205 -0.156102 -0.142793 -0.182875 -0.156215 -0.087332 0.232773 -0.009083 -0.008619 0.146763 -0.090289 0.119798 -0.091534 -0.011036 0.012854
polarizability: 4.45372963e+02 -8.97098162e+00 2.40592002e+02 1.23841298e+01 1.16680133e+01 1.25007718e+02
1716.lowfreq: 0.0002 0.0004 0.0005 1.1395 3.3555 7.3436 31.5419 39.7772 48.6090
frequency: 31.5265 39.7751 48.6041 94.3569 128.4900 133.2671 143.3651 174.5228 204.2440 235.1685 244.2490 256.9789 290.7915 344.7925 390.1586 413.7272 426.6687 438.7200 447.1862 463.1623 473.0206 483.6805 504.3943 524.0207 546.9671 555.7977 599.2235 615.4370 635.7304 656.9331 665.2260 677.6325 710.3855 711.8418 742.7156 744.8345 761.5620 778.6421 779.1374 792.0126 796.4184 817.2518 846.3426 864.3406 870.0651 893.2985 909.7218 941.1210 962.7932 971.6912 976.4153 986.8025 987.5627 996.1703 1010.2455 1025.1551 1028.7520 1072.6422 1087.3970 1100.1879 1129.4863 1132.7301 1133.5467 1163.4859 1169.9423 1177.5426 1188.4222 1202.9525 1217.2483 1248.8506 1257.4749 1286.5281 1295.0290 1305.4281 1348.1171 1365.5657 1385.0930 1389.3212 1395.0326 1426.4399 1440.1270 1444.1589 1449.2966 1460.9552 1469.9042 1489.5401 1507.7409 1567.2766 1581.9710 1590.8021 1614.1982 1621.3875 1623.9440 1628.5324 2982.2706 3026.5111 3123.0348 3130.4931 3134.5603 3136.1692 3136.7986 3143.9164 3151.5988 3162.3620 3165.3737 3166.2728 3174.8411 3534.4874
redmass: 5.8300 4.7578 6.2379 6.0907 5.3632 4.2506 4.4939 5.5067 6.4199 4.0591 2.6130 5.5060 6.4839 5.7678 6.5171 3.0815 3.0112 2.9869 6.4024 4.7074 7.6434 4.3067 3.7974 5.9041 6.1346 4.9076 5.7752 4.8900 4.9531 2.7701 4.6394 5.9430 6.6930 2.9673 3.1513 2.2258 1.3629 2.6831 3.7163 1.5520 3.8676 4.3729 1.5925 4.7927 1.3765 1.4932 1.4467 1.4867 1.5701 1.7105 3.5611 1.3674 1.3626 6.4776 1.3422 2.1719 2.6085 3.1490 3.0589 2.1128 2.0733 1.2235 1.6383 1.6598 1.1977 1.0929 1.7247 1.8303 2.3188 1.9383 2.8892 2.0415 1.5447 1.8630 3.8596 6.0090 2.5651 3.3865 6.5166 1.1860 3.7187 2.1238 2.6263 2.6735 2.9723 3.5703 4.3573 6.5958 7.0968 6.6242 6.3026 7.3257 7.1430 6.2246 1.0609 1.0993 1.0855 1.0894 1.0906 1.0882 1.0885 1.0947 1.0903 1.1003 1.0957 1.0950 1.0993 1.0786
irintensity: 0.2046 0.2393 0.3757 1.4763 2.2399 0.2984 0.4257 0.2527 0.7566 6.2627 7.4909 1.5517 2.1627 3.2545 5.6594 8.8420 3.6494 0.2206 10.0470 2.8807 2.3178 0.6065 1.7991 2.3607 0.3521 4.2881 0.9354 3.2544 9.5799 2.7240 2.6018 4.9165 8.3546 2.0659 13.9039 43.6193 161.0312 46.7236 0.8778 48.6573 0.2069 0.2530 26.5606 4.6218 0.1919 3.3220 0.9910 2.5208 4.6899 9.4799 8.8265 0.8871 0.4673 9.4384 0.7509 1.8934 15.4403 3.7589 14.5360 12.8450 71.7469 1.9760 6.6521 16.9680 1.1229 3.0365 2.0913 3.6046 32.7118 9.0608 67.2994 33.5174 1.3176 2.5872 24.3026 7.7892 6.1543 22.7804 50.6573 14.2287 19.9383 27.4216 1.8071 10.8503 17.1047 5.3933 4.8030 38.1559 2.5864 0.6434 49.4664 2.6723 3.9174 399.7938 12.1379 7.1423 3.6641 4.6581 14.1421 8.1340 2.9460 30.6871 7.3500 45.1189 7.0889 8.4164 17.5409 59.2173
temp: 298.150 k
press: 1.00000 atm
elementType: 8 7 7 6 6 6 6 6 6 6 6 6 6 6 6 6 6 6 6 6 6 6 6 6 1 1 1 1 1 1 1 1 1 1 1 1 1 1
symmnumber: 1
zpe: 765191.8 jmol-1
zpe.correction: 0.291446 hartree
zpe.thermalcorrener: 0.308856 hartree
zpe.thermalcorrenthalpy: 0.309800 hartree
zpe.thermalcorrgfe: 0.245588 hartree
zpe.sumelectzpe: -991.787822 hartree
zpe.sumelectthermal: -991.770412 hartree
zpe.sumelectthermalent: -991.769468 hartree
zpe.sumelectthermalfe: -991.833680 hartree
dipole: -3.5165 2.9714 -0.8647
dipole: 4.6843
quadrupole: -148.4968 -121.7537 -139.5832
quadrupole: 10.1150 -5.1867 5.0585
quadrupole: -11.8856 14.8576 -2.9720 10.1150 -5.1867 5.0585
hfenergy: -992.0792684 hartree
pointgroup: C01 [X(C21H14N2O1)]
dipole: -1.3784841 1.1801619 0.321609 debye
polarizability: 445.1921841|-15.5211617|198.3575847|6.8252167|56.8386671|167.4229141 unknown
InChI: InChI=1S/C21H14N2O/c24-21-19-8-4-3-7-18(19)20(22-23-21)14-9-10-17-15(12-14)11-13-5-1-2-6-16(13)17/h1-10,12,23H,11H2
charge 0 multiplicity 1
38 atoms
O  5.887813 -1.562727 -0.170354
N  2.313749 -1.861562 -0.776454
N  3.677942 -2.066658 -0.708321
C  -1.772196 0.133872 0.525039
C  -2.769453 0.702719 1.528318
C  -2.466731 -0.394948 -0.606217
C  -4.112613 0.460378 0.848253
C  -3.913456 -0.19022 -0.40914
C  -0.373064 0.072706 0.602097
C  0.362988 -0.52419 -0.462746
C  -1.744903 -0.998891 -1.659832
C  -0.338757 -1.061286 -1.578967
C  -5.408866 0.777199 1.289414
C  -5.015603 -0.526279 -1.226639
C  1.847485 -0.65821 -0.403887
C  2.748573 0.423392 0.022108
C  -6.514639 0.44055 0.467682
C  -6.31798 -0.205697 -0.778582
C  4.152091 0.142755 0.132811
C  2.309409 1.756334 0.280342
C  4.676595 -1.190145 -0.233954
C  5.064101 1.145314 0.546581
C  3.223004 2.745904 0.681058
C  4.602946 2.440752 0.832381
H  -2.593631 1.778443 1.725806
H  -2.706666 0.187677 2.50727
H  0.149477 0.441207 1.491554
H  -2.262446 -1.415266 -2.530911
H  0.241253 -1.532516 -2.378257
H  -5.569624 1.275223 2.252443
H  -4.870153 -1.026087 -2.190852
H  -7.531491 0.680598 0.797863
H  -7.185244 -0.458246 -1.398723
H  1.255938 2.01324 0.142229
H  6.123151 0.877353 0.618062
H  3.974833 -3.001314 -1.000994
H  2.86823 3.7648 0.87119
H  5.30414 3.218825 1.151628
