program: Gaussian 09
title: 000266872
version: EM64L-G09RevD.01
frameworkgroup: C1[X(C20H19N)]
method: RPBEPBE
basis: SDD
operation: Freq
keyword: #pfreq=noraman
keyword: PBEPBE/SDD
title: #p freq=noraman PBEPBE/SDD
converged: YES YES NO NO
title: Mulliken charges:
elementType: N C C C C C C C C C C C C C C C C C C C C H H H H H H H H H H H H H H H H H H H
charge: -0.256418 -0.465167 -0.582485 0.384491 0.411232 0.518442 -0.377075 -0.373997 -0.363583 -0.398762 -0.410823 -0.405362 -0.219571 -0.214362 -0.239471 -0.216007 -0.226437 -0.228459 -0.268102 -0.258141 -0.242361 0.239995 0.248292 0.228264 0.233729 0.259821 0.268644 0.227993 0.236214 0.227818 0.234551 0.222292 0.226758 0.219655 0.225259 0.224432 0.224314 0.226642 0.229543 0.228201
chargesum: 0.00000
title: Mulliken charges with hydrogens summed into heavy atoms:
elementType: N C C C C C C C C C C C C C C C C C C C C
charge: -0.256418 0.023120 -0.120491 0.384491 0.411232 0.518442 -0.117254 -0.105353 -0.135590 -0.162548 -0.183005 -0.170811 0.002721 0.012396 -0.019817 0.009253 -0.002005 -0.004145 -0.041461 -0.028597 -0.014160
polarizability: 2.62452971e+02 -9.77348689e-01 2.91916737e+02 -2.22082085e+01 -1.13142961e+01 1.25011097e+02
1716.lowfreq: -7.5995 -0.8478 0.0003 0.0004 0.0006 7.9449 14.3985 19.9836 24.7925
frequency: 14.2091 19.9477 24.5428 45.5582 67.7087 73.3803 93.6795 107.3896 182.6628 225.4911 245.5409 281.3329 318.1716 330.8168 366.5363 403.6149 407.9247 412.2246 420.0231 465.7850 498.8131 521.1478 547.1395 590.0973 612.4130 613.9909 617.8094 622.7210 693.1644 698.9961 704.8058 718.3745 753.1451 759.0601 769.0392 781.8051 819.6809 825.4268 841.4971 854.2838 866.5674 886.1882 910.5580 914.9175 960.6298 970.9449 976.4455 979.7841 980.4237 985.2289 989.4851 989.7568 992.2878 1000.6840 1017.7864 1022.6192 1026.2463 1031.4195 1064.6944 1083.4805 1095.2343 1101.2804 1170.4135 1171.7820 1172.0339 1178.6182 1186.6613 1186.8881 1197.8765 1215.4631 1245.5093 1275.2481 1287.7481 1309.4898 1327.9316 1331.2120 1354.1848 1358.5345 1375.5240 1382.0724 1384.3795 1438.8822 1440.5418 1449.6125 1476.7950 1482.1612 1483.6796 1487.2915 1493.2604 1577.0581 1586.7197 1592.1903 1604.2951 1613.2829 1617.3935 2998.6211 3018.5107 3051.1689 3079.4613 3111.8201 3113.3506 3123.1516 3124.7325 3130.2998 3130.7724 3131.2760 3142.9306 3147.1535 3152.8488 3154.0080 3159.3834 3162.0281 3167.5226 3169.8290
redmass: 3.7768 4.7621 3.6913 4.6981 4.1092 4.4289 4.0540 4.2832 4.3863 4.5403 4.5198 3.9270 5.1737 1.9963 3.1237 2.8266 2.9618 3.3012 4.2824 3.9958 3.1927 3.2207 4.2510 4.6873 5.8866 6.2715 6.3635 4.9754 1.9121 2.1026 1.9275 2.8774 1.7947 1.8782 2.0440 1.2908 1.4506 2.5832 1.2809 1.2860 2.6328 1.4644 1.4246 1.4928 1.3602 1.3655 1.4009 5.0799 1.3291 5.1004 1.3371 6.1966 1.5942 2.9446 1.9739 2.6076 2.1927 1.8997 2.7144 1.5963 1.5499 1.7214 1.0662 1.0495 1.0581 1.3147 1.1152 1.1201 1.1267 2.5228 3.4709 1.4663 1.3872 1.4134 1.2637 1.3756 1.6921 1.4284 4.5838 7.9863 7.4017 2.4087 2.1814 2.4632 1.1374 2.2257 2.3120 2.1543 1.1607 5.9056 6.3965 6.0325 6.0479 6.1500 6.0958 1.0596 1.0597 1.1012 1.1054 1.0879 1.0870 1.0845 1.0845 1.0887 1.0901 1.0881 1.0956 1.0924 1.0929 1.0949 1.0943 1.1014 1.1014 1.1002
irintensity: 0.4258 0.0338 1.4904 0.3178 0.1705 0.4473 0.2225 0.0784 2.2236 0.7259 0.4774 5.6722 0.4856 0.0988 0.2543 0.0197 3.1220 1.3439 2.5610 3.9153 31.6402 3.4582 18.3547 3.9007 0.7726 0.0564 0.0145 9.3466 47.0425 32.3579 37.5926 25.2564 121.7590 5.3199 28.7472 12.2743 1.4809 3.7977 1.6412 0.6867 7.2195 3.9974 1.2999 0.8617 0.1152 0.0482 0.0977 4.9837 0.9817 0.8352 0.0574 0.0321 3.4603 14.5203 26.6340 0.9266 9.9209 3.2667 32.0637 7.6761 8.2915 17.3500 6.2447 0.2031 0.6633 66.6348 3.9743 5.5923 3.6089 8.0579 87.7688 69.7465 14.1224 3.1245 2.5696 12.0336 85.4179 21.7912 12.1322 0.7194 6.3331 1.8554 6.6105 0.5101 3.0668 84.5595 37.0182 196.2599 37.0331 20.1929 5.3194 2.6443 173.6251 35.1390 53.4348 10.0801 38.1663 3.0886 21.0691 11.2744 11.9698 8.5129 6.2967 11.0608 7.6855 5.4139 40.6828 27.4629 51.8687 12.9546 31.0271 25.4181 18.5067 6.0386
temp: 298.150 k
press: 1.00000 atm
elementType: 7 6 6 6 6 6 6 6 6 6 6 6 6 6 6 6 6 6 6 6 6 1 1 1 1 1 1 1 1 1 1 1 1 1 1 1 1 1 1 1
symmnumber: 1
zpe: 866815.4 jmol-1
zpe.correction: 0.330153 hartree
zpe.thermalcorrener: 0.347844 hartree
zpe.thermalcorrenthalpy: 0.348788 hartree
zpe.thermalcorrgfe: 0.280749 hartree
zpe.sumelectzpe: -826.806436 hartree
zpe.sumelectthermal: -826.788744 hartree
zpe.sumelectthermalent: -826.787800 hartree
zpe.sumelectthermalfe: -826.855840 hartree
dipole: 0.7982 0.8254 -0.0246
dipole: 1.1485
quadrupole: -116.5623 -112.0907 -127.9897
quadrupole: -3.4709 -5.3644 -3.4152
quadrupole: 2.3186 6.7902 -9.1088 -3.4709 -5.3644 -3.4152
hfenergy: -827.1365884 hartree
pointgroup: C01 [X(C20H19N1)]
dipole: -0.3279665 0.3105839 0.0119041 debye
polarizability: 263.5662433|0.0943375|290.9803928|-18.8769728|16.371354|124.8341689 unknown
InChI: InChI=1S/C20H19N/c1-4-10-18(11-5-1)16-17-21(19-12-6-2-7-13-19)20-14-8-3-9-15-20/h1-15H,16-17H2
charge 0 multiplicity 1
40 atoms
N  0.892311 -0.001664 0.450405
C  -0.571068 -0.126649 0.620373
C  -1.36398 -0.03527 -0.72294
C  1.68728 -1.165336 0.259226
C  1.431981 1.318875 0.277786
C  -2.86055 -0.151222 -0.488465
C  3.100316 -1.118922 0.461146
C  2.290136 1.619558 -0.817318
C  1.101224 -2.423575 -0.072077
C  1.086636 2.363096 1.17815
C  -3.51107 -1.411885 -0.534864
C  -3.632851 0.994985 -0.163973
C  3.887059 -2.277944 0.322115
C  2.79244 2.924706 -0.996979
C  1.900665 -3.580338 -0.197226
C  1.582368 3.67099 0.984541
C  -4.893598 -1.5263 -0.265135
C  -5.015432 0.886344 0.106144
C  3.299045 -3.522691 -0.009233
C  2.440229 3.962291 -0.100875
C  -5.650953 -0.376436 0.05784
H  -0.930069 0.677993 1.285131
H  -0.797362 -1.079523 1.130562
H  -1.118303 0.933737 -1.196822
H  -1.012097 -0.830757 -1.405116
H  3.573691 -0.175119 0.747699
H  2.553788 0.826914 -1.525159
H  0.024554 -2.507851 -0.245536
H  0.452001 2.148227 2.044744
H  -2.932122 -2.307509 -0.795159
H  -3.147086 1.978913 -0.134818
H  4.968189 -2.210065 0.490507
H  3.448816 3.135013 -1.849141
H  1.421489 -4.532588 -0.453397
H  1.308625 4.459941 1.6944
H  -5.380223 -2.50729 -0.311362
H  -5.597343 1.783029 0.348373
H  3.914866 -4.422071 -0.112302
H  2.827287 4.976486 -0.245872
H  -6.723792 -0.462498 0.263723
