program: Gaussian 09
title: 000266871
version: EM64L-G09RevD.01
frameworkgroup: C1[X(C20H18O4)]
method: RPBEPBE
basis: SDD
operation: Freq
keyword: #pfreq=noraman
keyword: PBEPBE/SDD
title: #p freq=noraman PBEPBE/SDD
converged: YES YES NO NO
title: Mulliken charges:
elementType: O O O O C C C C C C C C C C C C C C C C C C C C H H H H H H H H H H H H H H H H H H
charge: -0.290604 -0.300132 -0.262085 -0.267067 0.214256 0.136129 -0.481050 0.339109 -0.305398 0.339923 -0.360750 0.391999 -0.333012 -0.393731 0.320814 -0.335765 -0.322476 -0.335631 -0.386826 -0.222110 -0.194702 -0.258625 -0.538033 -0.538332 0.284043 0.258623 0.255049 0.271035 0.259840 0.253697 0.244107 0.250634 0.252687 0.222007 0.225389 0.224933 0.223598 0.222421 0.247510 0.246301 0.222780 0.219442
chargesum: 0.00000
title: Mulliken charges with hydrogens summed into heavy atoms:
elementType: O O O O C C C C C C C C C C C C C C C C C C C C
charge: -0.290604 -0.300132 -0.262085 -0.267067 0.214256 0.136129 -0.197007 0.339109 -0.046775 0.339923 -0.105701 0.391999 -0.061977 -0.133891 0.320814 -0.082068 -0.078369 -0.084997 -0.134139 -0.000103 0.030687 -0.033692 0.155497 0.150190
polarizability: 2.73298514e+02 5.75162246e+00 2.70095162e+02 9.71996002e+00 -1.23230500e+01 1.69709930e+02
1716.lowfreq: -7.7320 -6.6362 -6.0166 -0.0008 -0.0005 -0.0004 12.6595 16.4846 27.6957
frequency: 12.0566 16.4248 27.6785 35.3525 46.9357 53.5977 84.4160 96.9318 139.0292 155.2601 160.6395 187.6777 205.4208 212.1127 238.7102 253.7046 261.8196 264.8916 341.2315 344.8982 362.1753 394.7361 410.9989 418.7007 436.8175 455.9405 479.2493 491.9085 501.8702 525.0944 540.9518 569.8463 586.2755 610.3413 616.0473 634.3683 668.7760 689.4266 696.9675 711.8646 738.0171 750.2728 759.9956 805.4919 813.3737 815.5393 826.9983 828.1662 840.9532 846.7437 895.1933 926.3977 932.1633 941.3964 957.4244 962.3994 980.8316 985.2189 988.3477 996.9034 997.7851 1018.7312 1077.2208 1082.4908 1105.6618 1112.0067 1112.2334 1139.9803 1155.1401 1157.0892 1158.2662 1166.3017 1168.0449 1178.7600 1182.2535 1198.5487 1232.0787 1254.5762 1281.8193 1293.4203 1308.1053 1367.0324 1379.6235 1388.4976 1402.1768 1419.9797 1436.1046 1439.2503 1442.9103 1466.9250 1467.9026 1469.4192 1471.4189 1472.9521 1487.7141 1492.7359 1584.0608 1590.3568 1597.2041 1605.4342 1615.1623 1623.3787 2957.8160 2959.5363 3044.9672 3046.9830 3126.0503 3126.2143 3127.0314 3135.7545 3152.3996 3152.9346 3154.5052 3159.7395 3162.2493 3170.3970 3172.0227 3172.0686 3175.7703 3182.5071
redmass: 4.7695 5.3960 4.3639 4.1819 3.8334 4.8275 3.6035 4.1780 4.5668 4.5004 4.7368 2.5847 2.8690 2.9662 1.3667 2.1445 3.5871 3.6420 5.2398 5.6916 5.9087 6.2451 2.9460 3.0409 4.1890 3.4985 4.8964 3.0491 3.0397 5.5329 6.3329 5.1515 5.5662 6.4604 3.8500 6.8466 6.3576 2.2159 3.9764 3.9020 5.5135 2.3854 2.2140 1.3761 1.7261 3.2551 1.6832 1.2882 5.2701 1.6929 1.4410 3.4374 1.5887 1.3359 1.3338 1.3627 1.2977 6.1460 8.7108 2.6215 4.2410 2.1004 1.5846 2.2410 1.3001 1.2602 1.2600 1.4995 1.3338 1.4281 1.5835 1.2779 1.1143 1.7910 2.3610 2.7984 4.9812 1.5085 4.3219 1.3580 1.3282 7.2896 6.3404 8.8857 4.0440 3.8534 1.1839 1.2375 2.3336 1.0501 1.0743 1.4979 1.2262 1.3499 2.0945 2.4797 7.9022 7.3318 6.5780 6.8547 6.8863 6.8641 1.0332 1.0331 1.1039 1.1039 1.0991 1.0847 1.0993 1.0891 1.0882 1.0928 1.0880 1.0886 1.0963 1.0914 1.0975 1.0983 1.0971 1.0970
irintensity: 1.1280 0.3572 0.3315 0.4721 1.3652 0.1962 4.3954 3.2652 1.4940 3.5810 2.2582 0.6523 4.8762 4.0982 1.6358 0.1086 0.8362 0.6567 1.2037 3.4741 4.1357 2.7699 0.3386 0.6191 2.3750 7.5503 9.2510 10.9952 14.3712 12.5005 8.1835 3.1868 2.5192 1.1217 6.4625 1.8562 10.0398 29.0133 2.6893 4.6657 15.6712 50.2533 41.5782 4.0972 16.7235 1.5843 92.8372 6.7529 53.8730 38.7435 4.6349 52.2737 11.3506 0.1941 0.4421 0.1102 0.6148 0.8982 45.3780 23.7765 57.0830 14.5327 23.3767 52.4421 17.7659 0.1313 0.1538 9.0308 3.4343 1.6665 20.2025 10.8796 1.0429 200.9278 318.7731 471.0312 70.4521 23.7355 78.8820 11.2862 1.6408 2.0923 40.1416 2.7332 27.7573 5.8369 33.8841 53.0482 1.6055 13.4620 50.1005 221.3494 122.6198 30.0774 280.0720 164.0245 49.2249 32.5871 31.1020 16.6820 98.1813 5.0272 70.5203 54.7034 48.2124 44.1304 26.4831 1.8568 26.6703 13.5842 11.0277 30.8902 9.5697 4.5511 17.6812 2.0653 13.0572 2.9489 0.9647 3.8130
temp: 298.150 k
press: 1.00000 atm
elementType: 8 8 8 8 6 6 6 6 6 6 6 6 6 6 6 6 6 6 6 6 6 6 6 6 1 1 1 1 1 1 1 1 1 1 1 1 1 1 1 1 1 1
symmnumber: 1
zpe: 857200.1 jmol-1
zpe.correction: 0.326490 hartree
zpe.thermalcorrener: 0.348232 hartree
zpe.thermalcorrenthalpy: 0.349176 hartree
zpe.thermalcorrgfe: 0.272117 hartree
zpe.sumelectzpe: -1072.060258 hartree
zpe.sumelectthermal: -1072.038517 hartree
zpe.sumelectthermalent: -1072.037572 hartree
zpe.sumelectthermalfe: -1072.114631 hartree
dipole: 3.7186 -0.4107 2.6773
dipole: 4.6004
quadrupole: -126.7923 -127.6232 -135.1994
quadrupole: -1.9573 7.0796 -3.0705
quadrupole: 3.0793 2.2484 -5.3278 -1.9573 7.0796 -3.0705
hfenergy: -1072.3867484 hartree
pointgroup: C01 [X(C20H18O4)]
dipole: 1.4226209 0.1123202 -1.1133168 debye
polarizability: 273.4924854|-7.2601251|264.5156549|-10.714687|-24.9363797|175.0954652 unknown
InChI: InChI=1S/C20H18O4/c1-21-15-8-10-17(11-9-15)24-20-14-18(22-2)12-13-19(20)23-16-6-4-3-5-7-16/h3-14H,1-2H3
charge 0 multiplicity 1
42 atoms
O  -0.02461 0.224182 0.101409
O  -2.495798 -0.012934 1.382838
O  0.272031 -4.732469 0.023026
O  5.443358 1.597863 0.109462
C  -0.500057 -1.072799 0.377149
C  -1.797284 -1.163623 0.94155
C  0.221522 -2.244429 0.04563
C  -0.356356 -3.510146 0.30648
C  -2.355659 -2.434553 1.194403
C  1.372911 0.492984 0.075933
C  -1.64554 -3.609166 0.88823
C  -3.04535 0.887573 0.434426
C  2.255945 0.010274 1.072788
C  1.828806 1.372035 -0.923408
C  4.077595 1.278284 0.035874
C  3.60652 0.399999 1.045665
C  3.184628 1.771609 -0.947752
C  -3.119235 0.615807 -0.95015
C  -3.568943 2.084302 0.972759
C  -3.728043 1.565923 -1.801341
C  -4.173587 3.021778 0.109624
C  -4.25673 2.769596 -1.2814
C  1.610505 -4.684609 -0.570225
C  5.971848 2.528654 -0.889704
H  1.210931 -2.147707 -0.408495
H  -3.350113 -2.481002 1.648126
H  -2.063804 -4.599393 1.086334
H  1.887839 -0.647454 1.866202
H  1.117571 1.745659 -1.665901
H  4.310953 0.048366 1.805346
H  3.52298 2.458899 -1.728403
H  -2.712937 -0.316355 -1.354961
H  -3.492067 2.259527 2.050018
H  -3.788941 1.359161 -2.875979
H  -4.579595 3.951166 0.524612
H  -4.727421 3.499863 -1.948168
H  2.329483 -4.170791 0.0975
H  1.596206 -4.181494 -1.556873
H  1.906925 -5.736221 -0.695202
H  7.037268 2.642191 -0.641688
H  5.467871 3.513143 -0.82942
H  5.869372 2.121909 -1.915015
