program: Gaussian 09
title: 000266869
version: EM64L-G09RevD.01
frameworkgroup: C1[X(C20H18N2O4S)]
method: RPBEPBE
basis: SDD
operation: Freq
keyword: #p
keyword: freq=noraman
keyword: PBEPBE/SDD
title: #p freq=noraman PBEPBE/SDD
converged: YES YES NO NO
title: Mulliken charges:
elementType: S O O O O N N C C C C C C C C C C C C C C C C C C C C H H H H H H H H H H H H H H H H H H
charge: 0.934088 -0.514692 -0.519730 -0.204460 -0.209167 -0.552367 0.009166 -0.515943 0.000980 0.520470 0.418321 0.167723 -0.242486 -0.235187 -0.310401 -0.377449 -0.379869 0.452012 -0.371844 -0.359981 -0.344689 -0.248189 -0.215661 -0.218631 -0.217933 -0.253103 -0.797776 0.313133 0.265224 0.282766 0.276290 0.271246 0.235232 0.286457 0.245269 0.246243 0.282350 0.242106 0.229550 0.228464 0.241943 0.231395 0.232010 0.231640 0.245482
chargesum: 0.00000
title: Mulliken charges with hydrogens summed into heavy atoms:
elementType: S O O O O N N C C C C C C C C C C C C C C C C C C C C
charge: 0.934088 -0.514692 -0.519730 -0.204460 -0.209167 -0.552367 0.009166 0.062413 0.000980 0.520470 0.418321 0.167723 0.040281 0.041103 -0.039155 -0.142217 -0.093412 0.452012 -0.126575 -0.113738 -0.062339 -0.006083 0.013888 0.009833 0.024009 -0.021708 -0.088645
polarizability: 3.38955874e+02 5.47368989e+00 2.26842158e+02 -1.08537091e+00 1.87839999e+01 2.53158895e+02
1716.lowfreq: -13.5605 -2.6553 -0.0002 0.0009 0.0013 4.6579 9.9033 18.5920 19.5016
frequency: -10.6498 18.4453 19.2958 24.4771 27.4113 28.9447 50.0848 59.4146 69.2192 103.4525 121.2859 123.7173 141.7744 173.6252 177.8149 214.5733 219.4147 227.0165 246.5728 272.6384 286.1328 311.5179 333.3717 357.5981 374.7532 381.4211 398.5595 404.7481 406.8117 419.6596 434.8010 471.0363 487.0561 505.6089 525.2745 555.7295 577.4904 587.4694 611.4560 620.8944 643.8178 653.0431 675.5788 700.0523 703.9393 711.1557 761.5223 765.5440 774.3343 776.4570 789.0392 801.9492 811.4651 821.6519 837.9762 845.5253 889.4388 918.5616 930.1768 955.6925 972.0023 976.4212 978.2920 983.2701 990.6607 991.0901 993.2917 996.3101 1006.7540 1022.9718 1043.9322 1049.1235 1050.0150 1051.3083 1067.4644 1093.4364 1120.5112 1142.3948 1171.8648 1173.5771 1185.6721 1189.2574 1194.2828 1212.1917 1218.1304 1246.8651 1270.7820 1297.4160 1298.2232 1321.2855 1331.1137 1367.0106 1373.9245 1382.3226 1391.5092 1391.7541 1400.0726 1433.9437 1438.8706 1441.8274 1470.6313 1473.1727 1473.5879 1475.5132 1478.3055 1579.1222 1581.8892 1593.6867 1595.9490 1603.9172 1610.3563 2981.8805 2984.7804 3060.7867 3064.7921 3094.8108 3127.3194 3134.1122 3134.6007 3138.4801 3140.0550 3149.3699 3149.9256 3155.7153 3163.7203 3166.0312 3168.8483 3170.0464 3185.1017
redmass: 3.9958 5.8410 4.9389 5.1274 1.0783 6.3184 4.0631 9.1641 7.3940 5.2344 7.2524 4.7249 6.0862 7.2484 5.8979 5.2853 8.3422 8.2421 7.2320 6.1526 5.0679 4.6630 3.1303 4.7487 6.5481 3.9813 8.7832 2.8897 2.9615 4.1220 5.8906 3.1261 3.6471 3.6602 5.1745 5.6970 5.3931 6.1187 6.2018 6.9516 5.4804 7.3479 5.5668 2.0076 3.0850 2.7895 4.6307 2.1558 4.8651 4.0385 1.5636 7.2946 6.3604 1.4175 1.2574 1.2585 1.3341 1.4918 8.5282 1.3071 1.5887 1.3890 1.3887 4.9510 2.7693 1.5659 2.3803 1.3470 1.3906 3.0452 2.9372 1.9502 2.0238 2.4313 3.3530 1.6994 1.2870 1.9861 1.2835 1.1289 1.1345 1.5074 1.1870 7.5758 3.0800 1.6003 1.8242 1.6485 1.2631 1.5430 1.5402 3.3166 6.1001 6.0016 3.1973 5.0327 1.2182 1.8356 1.4177 2.0898 1.1051 2.2648 2.2805 1.0753 2.2661 6.4027 6.1082 5.9769 6.9533 5.9960 6.3798 1.0392 1.0668 1.0916 1.0946 1.1001 1.0849 1.0884 1.0884 1.0892 1.0896 1.0913 1.0922 1.0958 1.0962 1.0952 1.1010 1.0963 1.0976
irintensity: 0.4571 0.1787 1.5873 0.9454 0.2591 3.2194 0.3973 0.1795 0.4137 0.1284 2.1178 2.3030 1.4411 0.5697 3.7217 0.5423 3.8709 14.7920 1.4323 4.8839 4.5739 8.3353 11.6644 2.1031 6.2691 6.0369 21.1270 0.1405 0.7534 17.0740 85.5911 8.2873 24.0992 120.4917 9.5544 5.3352 11.0848 34.8974 1.9551 0.3506 26.8624 12.0310 26.4638 37.9227 2.5281 12.3069 10.7405 49.3755 17.5365 49.3994 36.7665 149.5005 5.8893 21.9929 2.0476 0.8794 0.6076 16.8370 49.3410 0.3880 3.8514 0.6593 0.9685 0.0062 3.4576 3.2502 2.7221 1.9414 1.8934 18.3483 5.8020 77.7512 19.4407 2.8349 6.3196 17.9939 10.5370 1.3605 25.1499 6.9148 13.0286 20.0468 3.0476 195.8507 7.6270 42.1232 28.0972 27.5628 2.8811 30.9276 34.9129 109.3536 1.4250 0.5545 14.5422 26.8224 17.3170 20.3285 22.8804 17.2493 17.4903 35.6777 34.6992 15.1953 88.3378 11.9362 9.3027 13.5241 0.1643 44.0618 11.5135 23.2878 26.6623 4.2297 15.9733 13.5024 2.1083 2.1074 7.8920 11.7629 8.1637 4.3751 6.0593 18.5044 2.4568 15.1403 17.5982 7.5108 7.9177
temp: 298.150 k
press: 1.00000 atm
elementType: 16 8 8 8 8 7 7 6 6 6 6 6 6 6 6 6 6 6 6 6 6 6 6 6 6 6 6 1 1 1 1 1 1 1 1 1 1 1 1 1 1 1 1 1 1
symmnumber: 1
zpe: 882276.7 jmol-1
zpe.correction: 0.336041 hartree
zpe.thermalcorrener: 0.360363 hartree
zpe.thermalcorrenthalpy: 0.361308 hartree
zpe.thermalcorrgfe: 0.278305 hartree
zpe.sumelectzpe: -1579.211176 hartree
zpe.sumelectthermal: -1579.186854 hartree
zpe.sumelectthermalent: -1579.185910 hartree
zpe.sumelectthermalfe: -1579.268913 hartree
dipole: 5.4467 4.0964 0.4878
dipole: 6.8326
quadrupole: -136.6292 -169.7430 -168.3335
quadrupole: -3.1648 -24.3500 5.4224
quadrupole: 21.6060 -11.5078 -10.0983 -3.1648 -24.3500 5.4224
hfenergy: -1579.5472175 hartree
pointgroup: C01 [X(C20H18N2O4S1)]
dipole: -2.3429338 -1.2928953 -0.2554722 debye
polarizability: 337.7158154|-8.2889953|246.2144216|-10.6520704|-21.5687819|235.0266898 unknown
InChI: InChI=1S/C20H18N2O4S/c1-16-11-13-19(14-12-16)27(25,26)21(18-8-3-2-4-9-18)15-17-7-5-6-10-20(17)22(23)24/h2-14H,15H2,1H3
charge 0 multiplicity 1
45 atoms
S  -0.670041 0.890407 1.54157
O  -0.00837 2.355374 1.795122
O  -0.641998 -0.218423 2.740093
O  5.204574 0.932144 -2.477416
O  3.381623 2.151368 -1.870228
N  0.20978 0.268861 0.031858
N  4.196498 1.156764 -1.701712
C  1.462706 0.955439 -0.299133
C  -2.451268 1.088188 0.969402
C  -0.266698 -0.898915 -0.637341
C  2.714062 0.164915 0.106483
C  3.973345 0.242517 -0.556328
C  -3.405834 0.169522 1.429241
C  -2.757057 2.186693 0.150074
C  2.637836 -0.722052 1.210662
C  -0.155339 -0.974689 -2.055098
C  -0.854646 -1.983087 0.070981
C  -5.111106 1.446436 0.183734
C  -4.74444 0.360359 1.021397
C  -4.102117 2.352336 -0.242903
C  5.090268 -0.535077 -0.162515
C  3.747874 -1.481359 1.633159
C  -0.616784 -2.116154 -2.741504
C  -1.339624 -3.106023 -0.633836
C  4.979624 -1.396923 0.940932
C  -1.221059 -3.185546 -2.039391
C  -6.557586 1.656776 -0.222852
H  1.459338 1.933935 0.222644
H  1.478109 1.20562 -1.371879
H  -3.112522 -0.652346 2.089226
H  -1.979999 2.892065 -0.160908
H  1.688579 -0.812414 1.750489
H  0.28759 -0.14567 -2.616186
H  -0.902681 -1.954635 1.164515
H  -5.512143 -0.344283 1.360178
H  -4.371783 3.197652 -0.885993
H  6.020619 -0.439712 -0.72831
H  3.649455 -2.140292 2.502264
H  -0.514906 -2.162458 -3.831622
H  -1.790922 -3.933014 -0.073963
H  5.841434 -1.990462 1.261486
H  -1.58508 -4.066268 -2.57874
H  -6.634779 2.140222 -1.212004
H  -7.111698 0.703293 -0.261281
H  -7.077332 2.310917 0.503735
