program: Gaussian 09
title: 000266868
version: EM64L-G09RevD.01
frameworkgroup: C1[X(C20H16Br2N2O)]
method: RPBEPBE
basis: SDD
operation: Freq
keyword: #p
keyword: freq=noraman
keyword: PBEPBE/SDD
title: #p freq=noraman PBEPBE/SDD
converged: YES YES NO NO
title: Mulliken charges:
elementType: Br Br O N N C C C C C C C C C C C C C C C C C C C C H H H H H H H H H H H H H H H H
charge: 0.002045 -0.012535 -0.230162 -0.378773 -0.440620 -0.273689 0.071165 0.511327 0.454675 0.301904 -0.427514 -0.424568 -0.357148 -0.330438 -0.317697 -0.330269 -0.145602 -0.155130 -0.213074 -0.185543 -0.261714 -0.234681 -0.248530 -0.243681 -0.221100 0.247858 0.291151 0.339744 0.229534 0.231609 0.254967 0.260017 0.252855 0.278398 0.249224 0.245632 0.249028 0.245971 0.238786 0.237956 0.238621
chargesum: 0.00000
title: Mulliken charges with hydrogens summed into heavy atoms:
elementType: Br Br O N N C C C C C C C C C C C C C C C C C C C C
charge: 0.002045 -0.012535 -0.230162 -0.087622 -0.100876 -0.025831 0.071165 0.511327 0.454675 0.301904 -0.197980 -0.192959 -0.102181 -0.070421 -0.064842 -0.051871 0.103622 0.090502 0.035954 0.060428 -0.022928 0.003275 -0.248530 -0.243681 0.017521
polarizability: 3.47622507e+02 1.25963838e+01 3.56279397e+02 1.89887514e+01 -2.82359937e+01 1.66062415e+02
1716.lowfreq: -2.9444 -0.0004 -0.0002 0.0003 2.4461 2.7689 10.6990 16.4774 29.9318
frequency: 10.5777 16.4474 29.9156 36.3155 47.3663 49.7133 66.6319 96.3280 103.9260 112.5657 143.8422 147.8030 162.9070 182.8386 220.2664 247.0328 264.9342 299.6394 302.7201 315.4548 336.5935 364.8500 398.1414 408.9717 411.7195 419.1214 454.9953 465.8376 494.3806 506.2408 508.3732 568.6757 598.7923 612.0648 613.5767 623.3065 626.9040 655.9203 667.4753 686.2273 695.2209 697.2744 700.5265 774.2812 793.5855 794.6401 807.5635 812.7331 818.8229 836.0248 853.8511 890.1115 929.3103 935.1947 943.9417 948.2854 950.3774 973.3962 979.5755 983.2396 989.2556 993.1752 1012.1554 1025.6185 1033.4502 1063.3012 1066.9194 1091.0600 1108.5815 1120.8727 1141.0783 1176.1964 1189.7654 1190.5160 1194.3545 1217.2980 1262.4619 1279.9295 1294.4074 1297.7141 1310.7921 1323.7637 1336.7363 1364.4659 1368.0458 1389.6135 1406.4162 1408.9351 1436.1882 1465.8871 1471.9070 1481.7476 1484.3554 1502.4424 1555.4147 1577.2361 1581.1983 1596.4496 1604.7996 1609.3057 1616.7701 3023.0811 3127.0392 3127.7165 3133.5530 3134.3073 3145.5147 3155.1587 3157.1281 3165.4682 3166.6701 3167.3654 3169.7275 3174.9690 3175.1417 3474.1443 3534.8376
redmass: 12.3985 7.6266 4.4279 5.6056 6.8981 4.8046 4.8144 7.4200 7.2266 9.0771 6.4251 5.2791 9.1547 8.4047 6.4060 5.5309 6.1223 7.2246 5.1357 7.5807 5.2786 6.7662 2.7812 2.9695 3.0410 4.2450 3.2632 5.2906 1.6964 2.6958 2.3965 4.1060 5.3799 1.3628 6.2893 5.2125 4.7060 5.6835 6.0713 3.6010 2.1265 2.6903 2.9814 3.1952 3.1699 1.3158 1.2634 1.6329 1.7130 4.5847 1.2588 3.9473 1.3259 1.3396 1.4942 1.3564 1.3599 4.4305 4.5477 4.5446 3.0230 1.8102 1.3540 2.8659 3.4617 2.6252 2.4713 1.5891 1.7892 1.3836 2.4732 1.0614 1.1091 1.1221 1.1308 1.5527 1.9281 2.3733 1.4249 1.4265 1.8794 1.3870 1.8205 2.5447 3.1879 8.8366 3.9255 3.9423 2.3035 1.7628 1.8452 2.2863 2.1544 2.8375 6.6248 5.0912 5.3553 5.4245 6.4730 6.0094 6.3375 1.0826 1.0897 1.0895 1.0880 1.0858 1.0887 1.0877 1.0928 1.0951 1.0957 1.0952 1.0957 1.1003 1.0964 1.0760 1.0765
irintensity: 0.1587 0.3796 0.1315 0.2249 0.8518 0.4240 0.1772 0.7729 1.8311 0.2454 0.3622 0.7688 0.5041 1.0156 0.8669 3.4324 2.6851 2.5984 1.3709 11.9181 10.4910 18.3905 0.0251 0.4152 1.1109 9.5666 41.0185 9.3981 73.7957 6.9480 11.8077 53.7260 2.2796 79.0136 0.8885 19.4547 13.2697 66.5196 24.7181 2.9076 48.0600 24.3842 7.7586 47.4117 39.9770 15.7797 5.3118 64.0624 83.2547 5.1240 0.9654 3.3282 0.0253 0.0203 1.6959 0.2204 0.8938 33.6755 29.0383 24.6503 4.4696 1.1957 1.2382 51.2962 78.2768 29.0633 20.8276 8.5002 24.9049 22.7848 75.6619 2.3455 22.8567 16.4163 25.9412 22.0909 64.7858 154.9554 39.4107 20.5612 72.5644 26.8161 127.7136 12.0228 47.6502 3.9603 12.0556 3.3142 37.5660 35.6983 65.0509 140.5076 420.5097 278.5424 162.1032 4.3628 1.9282 34.7587 99.5645 29.5399 100.5074 42.9178 7.8540 12.0732 22.7666 2.5863 8.3955 3.4011 7.5438 8.2613 12.9682 9.3847 1.8910 20.4565 1.8752 152.4553 27.1195
temp: 298.150 k
press: 1.00000 atm
elementType: 35 35 8 7 7 6 6 6 6 6 6 6 6 6 6 6 6 6 6 6 6 6 6 6 6 1 1 1 1 1 1 1 1 1 1 1 1 1 1 1 1
symmnumber: 1
zpe: 807896.5 jmol-1
zpe.correction: 0.307712 hartree
zpe.thermalcorrener: 0.330358 hartree
zpe.thermalcorrenthalpy: 0.331302 hartree
zpe.thermalcorrgfe: 0.250371 hartree
zpe.sumelectzpe: -981.631161 hartree
zpe.sumelectthermal: -981.608515 hartree
zpe.sumelectthermalent: -981.607571 hartree
zpe.sumelectthermalfe: -981.688502 hartree
dipole: -4.8717 -3.1951 -0.0443
dipole: 5.8261
quadrupole: -169.8984 -168.4700 -157.9480
quadrupole: 8.7575 6.4532 0.9377
quadrupole: -4.4596 -3.0312 7.4908 8.7575 6.4532 0.9377
hfenergy: -981.9388728 hartree
pointgroup: C01 [X(C20H16Br2N2O1)]
dipole: -0.4737125 2.2324333 0.2143133 debye
polarizability: 295.6809393|-13.1712174|356.9811816|-88.1924321|-0.4291676|217.302198 unknown
InChI: InChI=1S/C20H16Br2N2O/c21-15-6-10-17(11-7-15)23-20(19(25)14-4-2-1-3-5-14)24-18-12-8-16(22)9-13-18/h1-13,20,23-24H
charge 0 multiplicity 1
41 atoms
Br 5.649106 0.342108 -2.650944
Br -0.958143 -6.942245 -0.345269
O  -2.30447 1.36437 2.10607
N  0.557023 0.317483 0.900139
N  -1.537279 -0.944986 1.128177
C  -0.868517 0.185643 0.52393
C  -1.604601 1.467949 1.050918
C  1.676548 0.322519 0.0579
C  -1.370799 -2.288908 0.777836
C  -1.446748 2.772937 0.349433
C  2.967464 0.49553 0.641789
C  -2.199516 -3.269317 1.399796
C  1.598573 0.15913 -1.358093
C  -0.407784 -2.724256 -0.176694
C  -0.625485 2.953461 -0.797322
C  -2.185162 3.881904 0.853771
C  4.132392 0.49683 -0.146282
C  -2.08103 -4.633835 1.074348
C  2.767455 0.161983 -2.150139
C  -0.292065 -4.091276 -0.509822
C  -0.548723 4.214125 -1.42453
C  -2.108779 5.137844 0.224223
C  4.026466 0.331395 -1.544305
C  -1.127923 -5.036383 0.114566
C  -1.290211 5.307624 -0.919287
H  -0.921139 0.143124 -0.579062
H  0.729771 0.348088 1.90715
H  -2.181891 -0.691782 1.885198
H  3.057206 0.627824 1.726749
H  -2.947649 -2.958032 2.138644
H  0.639233 0.011876 -1.865066
H  0.279346 -2.015096 -0.645309
H  -0.022771 2.132246 -1.194103
H  -2.812312 3.727369 1.737692
H  5.110302 0.628262 0.325908
H  -2.727117 -5.370673 1.560421
H  2.686577 0.029426 -3.233091
H  0.455758 -4.409527 -1.242157
H  0.092752 4.345566 -2.30218
H  -2.683427 5.982975 0.617749
H  -1.229531 6.284725 -1.411156
