program: Gaussian 09
title: 000266864
version: EM64L-G09RevD.01
frameworkgroup: C1[X(C19H16O2)]
method: RPBEPBE
basis: SDD
operation: Freq
keyword: #pfreq=noraman
keyword: PBEPBE/SDD
title: #p freq=noraman PBEPBE/SDD
converged: YES YES NO NO
title: Mulliken charges:
elementType: O O C C C C C C C C C C C C C C C C C C C H H H H H H H H H H H H H H H H
charge: -0.304372 -0.266779 0.357032 0.338593 0.325090 -0.385475 -0.373254 -0.369921 -0.399523 -0.397391 -0.396333 0.326056 -0.234394 -0.235281 -0.359823 -0.360677 -0.243991 0.319271 -0.331575 -0.324676 -0.537579 0.237601 0.240901 0.263837 0.255073 0.236451 0.236298 0.224557 0.224558 0.263671 0.258921 0.228929 0.242883 0.253862 0.221300 0.219886 0.246274
chargesum: 0.00000
title: Mulliken charges with hydrogens summed into heavy atoms:
elementType: O O C C C C C C C C C C C C C C C C C C C
charge: -0.304372 -0.266779 0.357032 0.338593 0.325090 -0.147873 -0.132353 -0.106084 -0.144450 -0.160940 -0.160035 0.326056 -0.009837 -0.010723 -0.096152 -0.101757 -0.015062 0.319271 -0.088692 -0.070814 0.149880
polarizability: 3.76014072e+02 -6.84548800e+00 1.74186302e+02 1.79732367e+01 9.55547505e+00 1.41538302e+02
1716.lowfreq: -10.1623 -0.0003 0.0007 0.0007 3.2569 3.9970 18.4028 28.8444 36.6179
frequency: 18.3797 28.7969 36.6082 70.3483 73.2662 91.3661 111.4059 154.8987 178.6865 210.9079 231.1021 241.7212 301.0067 329.4757 348.0817 367.8371 405.4898 414.1699 419.7922 422.9086 459.9796 486.6734 504.9108 536.3707 546.3937 591.6728 613.7816 629.1863 632.1170 681.8736 701.7047 714.1839 722.8623 729.2118 769.2801 784.5505 802.2113 828.1808 831.7805 841.6539 847.3787 856.2478 916.3799 930.3324 951.6552 955.2582 964.0257 972.0150 987.8338 988.2343 992.4031 992.7452 996.8819 1012.6616 1039.9461 1084.0464 1103.2194 1111.7680 1116.6444 1150.4323 1156.1633 1170.6676 1172.9630 1182.8020 1194.5272 1212.9985 1240.5979 1289.7226 1290.1238 1300.9926 1311.5940 1354.3888 1372.8844 1377.1657 1418.4392 1420.0408 1435.2253 1439.3320 1466.6645 1470.6666 1473.6403 1488.8040 1509.3608 1571.3572 1587.2174 1592.9695 1611.8397 1614.8646 1622.0607 2957.0875 3043.8129 3121.3263 3124.8053 3125.3616 3135.3417 3137.4221 3140.8247 3147.4912 3147.7714 3157.9792 3162.8642 3164.2610 3167.6261 3169.0187 3178.5577
redmass: 4.5715 5.1404 3.6866 4.9778 3.8079 4.0861 4.3996 4.3337 4.6605 5.2489 1.6286 2.2227 5.1228 4.7355 6.2487 6.1634 2.8494 2.9845 3.1041 4.3310 4.2390 3.6734 2.8605 4.4387 2.9490 4.9322 6.5080 7.0021 6.7477 5.3225 1.7300 3.8155 4.6573 4.2022 1.9301 5.3489 1.3198 1.2790 1.5842 1.6840 1.3700 4.2269 1.4378 1.3499 1.3505 1.3391 1.3665 1.4266 5.3258 8.3994 1.3409 5.1640 2.6498 2.7874 1.8924 1.6264 1.2770 1.2603 1.3255 1.5970 1.5858 1.2423 1.0527 1.5823 1.2615 2.1359 5.3040 1.2850 3.0187 1.3309 1.4745 3.0175 6.0411 8.8421 4.1291 3.8645 1.1819 2.4248 1.0502 1.5102 1.4184 2.1919 2.8574 6.2968 6.8248 7.7115 6.1092 6.3620 6.4651 1.0331 1.1039 1.0844 1.0991 1.0874 1.0886 1.0899 1.0903 1.0882 1.0957 1.0883 1.0952 1.1013 1.0961 1.0963 1.0976
irintensity: 1.2424 0.1408 0.7970 1.3486 1.2645 1.1170 2.4788 3.4490 0.7178 0.4243 0.5750 0.7542 3.0912 0.7842 1.1005 11.3338 0.6519 3.9029 0.6106 4.5924 2.4337 13.1299 35.8260 7.7949 3.8501 6.1751 1.5771 2.8071 4.8530 6.2634 48.1949 7.2319 10.2741 7.6429 78.4752 6.6993 14.3273 2.9244 84.1265 35.5445 6.8049 46.5351 1.8126 0.3367 0.5261 0.0432 0.6874 0.1014 5.8839 39.5100 0.6591 18.6731 16.6222 0.6979 6.2300 8.9826 18.8140 0.1730 10.0148 2.5225 6.4623 11.7075 0.0995 310.8080 133.2103 384.9381 68.3010 0.0579 17.5446 8.1117 1.3270 1.7732 2.2602 3.1492 6.1180 1.1352 41.1191 5.0688 13.0622 358.5309 36.3891 257.2809 35.7280 1.6066 2.4840 2.7864 54.3906 10.8568 40.0701 67.1543 49.9237 10.2859 28.9333 0.7585 16.6014 20.6118 0.9035 12.6326 45.8751 5.8246 11.4107 28.1857 8.4054 2.5453 3.3352
temp: 298.150 k
press: 1.00000 atm
elementType: 8 8 6 6 6 6 6 6 6 6 6 6 6 6 6 6 6 6 6 6 6 1 1 1 1 1 1 1 1 1 1 1 1 1 1 1 1
symmnumber: 1
zpe: 767204.4 jmol-1
zpe.correction: 0.292213 hartree
zpe.thermalcorrener: 0.309956 hartree
zpe.thermalcorrenthalpy: 0.310900 hartree
zpe.thermalcorrgfe: 0.244257 hartree
zpe.sumelectzpe: -882.589659 hartree
zpe.sumelectthermal: -882.571916 hartree
zpe.sumelectthermalent: -882.570971 hartree
zpe.sumelectthermalfe: -882.637614 hartree
dipole: -0.4896 -2.4076 1.1730
dipole: 2.7225
quadrupole: -107.9697 -115.6642 -119.0113
quadrupole: 9.4490 -3.4432 0.4848
quadrupole: 6.2454 -1.4491 -4.7963 9.4490 -3.4432 0.4848
hfenergy: -882.8818713 hartree
pointgroup: C01 [X(C19H16O2)]
dipole: 0.1676154 1.0535803 -0.0958402 debye
polarizability: 376.4394149|-10.1820299|156.4157117|-12.8375693|-19.0985219|158.8835492 unknown
InChI: InChI=1S/C19H16O2/c1-20-17-11-13-19(14-12-17)21-18-9-7-16(8-10-18)15-5-3-2-4-6-15/h2-14H,1H3
charge 0 multiplicity 1
37 atoms
O  1.522244 -1.479313 0.913917
O  6.323099 1.027175 -0.645176
C  -2.492971 -0.245157 0.202413
C  -3.91143 0.150893 -0.028985
C  0.218823 -0.995904 0.652238
C  -1.448366 0.222419 -0.641261
C  -2.13557 -1.109866 1.275298
C  -0.103369 -0.142983 -0.429552
C  -0.798264 -1.48319 1.503886
C  -4.814987 0.307805 1.059338
C  -4.404288 0.383659 -1.343597
C  2.668465 -0.76081 0.474049
C  -6.158714 0.68021 0.842576
C  -5.746616 0.760126 -1.561916
C  2.819253 0.626317 0.680034
C  3.720504 -1.52397 -0.081675
C  -6.632971 0.909839 -0.469919
C  5.081997 0.502768 -0.247595
C  4.026433 1.264423 0.313927
C  4.925695 -0.893771 -0.439211
C  6.543377 2.46132 -0.450023
H  -1.684021 0.905224 -1.465136
H  -2.918251 -1.518813 1.923504
H  0.68062 0.228171 -1.096409
H  -0.52536 -2.15704 2.321397
H  -4.454901 0.166633 2.084918
H  -3.740276 0.237304 -2.20319
H  -6.83291 0.801722 1.698031
H  -6.104248 0.925648 -2.584568
H  2.008517 1.206899 1.131683
H  3.582258 -2.600198 -0.219866
H  -7.675764 1.200279 -0.63901
H  4.130166 2.340442 0.481006
H  5.756183 -1.460792 -0.869725
H  6.481148 2.737228 0.620999
H  5.818034 3.064424 -1.03089
H  7.561363 2.648877 -0.821714
