program: Gaussian 09
title: 000266863
version: EM64L-G09RevD.01
frameworkgroup: C1[X(C19H16O2)]
method: RPBEPBE
basis: SDD
operation: Freq
keyword: #pfreq=noraman
keyword: PBEPBE/SDD
title: #p freq=noraman PBEPBE/SDD
converged: YES YES NO NO
title: Mulliken charges:
elementType: O O C C C C C C C C C C C C C C C C C C C H H H H H H H H H H H H H H H H
charge: -0.309050 -0.300723 0.297115 0.278168 0.118321 -0.536385 0.325572 -0.327246 -0.387590 -0.404589 -0.371347 -0.235556 -0.233284 0.347333 -0.243967 -0.356371 -0.385505 -0.520199 -0.209110 -0.193575 -0.253132 0.287836 0.252776 0.260641 0.243450 0.278275 0.226066 0.228169 0.229549 0.262480 0.257540 0.226662 0.229454 0.233560 0.218121 0.236956 0.229584
chargesum: 0.00000
title: Mulliken charges with hydrogens summed into heavy atoms:
elementType: O O C C C C C C C C C C C C C C C C C C C
charge: -0.309050 -0.300723 0.297115 0.278168 0.118321 -0.248549 0.325572 -0.074471 -0.126949 -0.161138 -0.093071 -0.009490 -0.005115 0.347333 -0.014419 -0.093892 -0.127965 0.168438 0.017551 0.035878 -0.023548
polarizability: 2.82659504e+02 -6.01765014e+00 2.30153014e+02 3.88566119e+00 1.39464666e+01 1.34697909e+02
1716.lowfreq: -0.0006 -0.0002 0.0004 4.7090 6.8415 10.8710 23.6188 38.7545 46.9727
frequency: 23.0859 38.5613 46.9649 59.9865 79.7518 85.5640 96.6195 135.4149 153.4013 200.4829 221.8059 252.0032 259.8238 286.4196 321.9809 348.8264 404.6466 411.1292 412.1077 438.3207 477.6885 487.2040 526.0448 536.7368 568.4833 610.5985 615.5549 621.3439 630.3050 688.9322 697.0348 702.3153 719.1270 741.2114 760.7727 777.9182 797.5210 833.1966 836.3278 853.3129 887.4684 892.1714 908.3912 927.7056 948.6150 956.1484 967.8788 977.8352 985.8162 986.0322 988.8018 995.9210 1016.4076 1020.2251 1038.6251 1078.5926 1083.4748 1105.4471 1109.4664 1148.3234 1148.8618 1168.5215 1173.2297 1174.5012 1185.2952 1194.7185 1211.6819 1244.2660 1287.2768 1308.1913 1316.1332 1359.2032 1369.9785 1385.1518 1396.8472 1431.5934 1437.1297 1443.5445 1460.0743 1466.3665 1469.7173 1473.0147 1496.3671 1574.1075 1586.2558 1594.2822 1603.9604 1611.0055 1611.6440 2960.9545 3052.9626 3116.5946 3120.6079 3129.0977 3130.1011 3139.6662 3142.3025 3152.0092 3155.6918 3156.2427 3158.9690 3164.6765 3172.6275 3174.4842 3177.4436
redmass: 5.4810 4.1810 3.8926 3.9432 3.4007 3.8562 4.3020 3.9866 1.1421 4.5067 4.1215 5.2245 6.2951 5.6577 5.1998 6.2788 2.9123 2.9440 4.4511 3.9847 3.7014 4.9845 3.8740 4.2854 5.0061 6.3968 6.2297 4.9196 5.1851 3.4385 3.1693 1.8770 4.5174 2.8633 1.6593 2.1327 5.2393 1.3434 1.4675 1.2491 2.4458 2.0836 1.4446 1.4586 2.2880 2.3725 1.3618 1.3885 1.4764 4.0115 5.7146 1.3286 3.4977 2.1053 2.0383 1.4990 1.6137 1.4118 1.2532 1.5968 1.7792 1.1151 1.0760 1.2384 2.6311 1.1264 3.6628 1.6499 2.4476 1.3552 1.4309 6.8186 4.5032 8.5947 3.5375 1.2660 2.4631 2.3203 1.0555 2.2953 1.0585 2.2869 2.7487 6.4865 6.7429 6.3919 7.1767 6.3188 6.1489 1.0316 1.1038 1.1010 1.0855 1.0878 1.0850 1.0890 1.0936 1.0913 1.0885 1.0927 1.0977 1.0962 1.0977 1.1003 1.0974
irintensity: 0.3679 0.2984 0.5263 1.1592 2.2172 3.1717 2.1850 2.2868 0.0570 2.3011 1.4699 0.8875 3.1240 1.4232 1.2674 4.6687 0.8790 0.4960 9.7944 4.9721 7.7111 21.0140 5.8754 0.9089 8.9451 1.1674 0.1670 9.2081 2.0968 23.1235 13.9150 36.8329 17.6630 40.3182 75.4072 27.4140 17.9092 12.0103 28.4320 0.8743 25.7070 36.8838 8.5534 1.9200 25.5682 25.5314 0.2259 1.7615 0.5327 0.7495 0.2456 0.6203 6.1947 18.8799 17.2397 11.3037 8.0574 24.3013 1.3720 5.7767 1.7181 20.9711 13.8593 99.1114 152.3528 1.1449 236.0306 2.7056 56.1559 0.4908 4.9069 1.1478 10.6082 7.0399 39.3111 9.8632 12.4207 0.8763 11.9650 268.8015 11.2106 57.4930 29.6251 45.5364 2.9573 46.7744 35.2656 14.9353 10.9520 64.7457 38.9279 27.2963 6.0198 2.5058 2.1021 10.8574 29.7657 10.8007 2.9191 26.6376 28.3143 14.7223 10.4299 8.4965 4.6673
temp: 298.150 k
press: 1.00000 atm
elementType: 8 8 6 6 6 6 6 6 6 6 6 6 6 6 6 6 6 6 6 6 6 1 1 1 1 1 1 1 1 1 1 1 1 1 1 1 1
symmnumber: 1
zpe: 766024.1 jmol-1
zpe.correction: 0.291763 hartree
zpe.thermalcorrener: 0.309691 hartree
zpe.thermalcorrenthalpy: 0.310635 hartree
zpe.thermalcorrgfe: 0.244079 hartree
zpe.sumelectzpe: -882.583052 hartree
zpe.sumelectthermal: -882.565124 hartree
zpe.sumelectthermalent: -882.564180 hartree
zpe.sumelectthermalfe: -882.630737 hartree
dipole: 0.3753 1.4619 2.1030
dipole: 2.5885
quadrupole: -111.8387 -114.8357 -119.8472
quadrupole: -2.6408 3.8497 -0.3844
quadrupole: 3.6685 0.6715 -4.3400 -2.6408 3.8497 -0.3844
hfenergy: -882.8748151 hartree
pointgroup: C01 [X(C19H16O2)]
dipole: -0.1899881 0.4586376 -0.8892163 debye
polarizability: 281.9461564|8.9190769|226.0252996|1.543668|-25.3564531|139.5389718 unknown
InChI: InChI=1S/C19H16O2/c1-20-19-13-12-17(21-16-10-6-3-7-11-16)14-18(19)15-8-4-2-5-9-15/h2-14H,1H3
charge 0 multiplicity 1
37 atoms
O  2.45577 -1.160433 0.828371
O  -3.023723 -2.252348 0.038313
C  -1.219296 -0.54088 0.222081
C  -2.154113 0.620276 0.119528
C  -1.655555 -1.902134 0.1937
C  0.169486 -0.300222 0.399486
C  1.079988 -1.367734 0.547121
C  -0.738661 -2.961376 0.368139
C  0.635686 -2.706098 0.548468
C  -1.770933 1.789819 -0.594112
C  -3.421208 0.608643 0.767399
C  -2.623879 2.912648 -0.660454
C  -4.271541 1.733097 0.702972
C  3.187344 -0.134427 0.178675
C  -3.879553 2.8902 -0.010577
C  2.911368 0.296738 -1.140602
C  4.289294 0.380495 0.89722
C  -3.543809 -2.10185 -1.335709
C  3.751929 1.265272 -1.734013
C  5.121203 1.345229 0.289236
C  4.855717 1.795544 -1.026006
H  0.530121 0.730545 0.475098
H  -1.125115 -3.985156 0.356207
H  1.358475 -3.513971 0.692388
H  -0.806856 1.812172 -1.11619
H  -3.729854 -0.284029 1.318867
H  -2.310803 3.8005 -1.221322
H  -5.239835 1.707855 1.215599
H  -4.542861 3.760983 -0.059879
H  2.068509 -0.125249 -1.696759
H  4.476127 0.017183 1.912175
H  3.54578 1.597794 -2.757639
H  5.97578 1.746395 0.845138
H  -4.603877 -2.394126 -1.285012
H  -2.999581 -2.772606 -2.029041
H  -3.460456 -1.055524 -1.685019
H  5.502232 2.545373 -1.493846
