program: Gaussian 09
title: 000266860
version: EM64L-G09RevD.01
frameworkgroup: C1[X(C18H14ClN)]
method: RPBEPBE
basis: SDD
operation: Freq
keyword: #p
keyword: freq=noraman
keyword: PBEPBE/SDD
title: #p freq=noraman PBEPBE/SDD
converged: YES YES NO NO
title: Mulliken charges:
elementType: Cl N C C C C C C C C C C C C C C C C C C H H H H H H H H H H H H H H
charge: -0.064615 -0.346486 0.351453 0.338136 0.338071 -0.363276 -0.363541 -0.374021 -0.374532 -0.377239 -0.376635 -0.195272 -0.195299 -0.209908 -0.209709 -0.209957 -0.210046 -0.129839 -0.258792 -0.258798 0.272153 0.272133 0.266251 0.266273 0.266023 0.265949 0.254485 0.254495 0.227798 0.227787 0.228164 0.228181 0.230302 0.230312
chargesum: 0.00000
title: Mulliken charges with hydrogens summed into heavy atoms:
elementType: Cl N C C C C C C C C C C C C C C C C C C
charge: -0.064615 -0.346486 0.351453 0.338136 0.338071 -0.091123 -0.091408 -0.107770 -0.108259 -0.111216 -0.110686 0.059213 0.059196 0.017890 0.018078 0.018207 0.018135 -0.129839 -0.028490 -0.028486
polarizability: 2.92962996e+02 -2.25506880e-04 2.53278306e+02 -1.52479492e-02 6.57496121e-01 1.25295540e+02
1716.lowfreq: -7.4358 -5.3980 -0.0008 0.0010 0.0011 3.8511 35.6444 37.6327 44.6657
frequency: 35.5967 37.6192 44.6569 60.3668 75.4230 85.8909 140.4852 192.5902 228.4962 245.4848 254.7209 303.3440 312.9394 352.7691 407.6818 408.9104 413.7194 435.4088 437.6777 496.2060 515.3127 521.3605 611.3812 612.1793 615.9200 628.6773 651.2034 695.1917 699.9213 702.0219 717.6813 759.1049 759.5170 816.8971 819.2350 840.8497 847.6539 893.1225 900.6261 914.0504 918.4342 943.6460 958.1978 972.0589 974.8617 985.4151 985.5844 987.9423 988.6143 992.2651 1024.5658 1026.7567 1073.3195 1083.8550 1086.6461 1113.0458 1171.0064 1171.5249 1174.4135 1183.3448 1186.7221 1191.5952 1275.9892 1284.1017 1294.7338 1315.2365 1330.2790 1357.0636 1379.2189 1384.3718 1406.6341 1440.4117 1447.2182 1474.7891 1480.1098 1480.1764 1572.6669 1585.6391 1589.3401 1596.2542 1602.8132 1613.9910 3127.1591 3127.3682 3134.2051 3134.4536 3149.6614 3150.1411 3152.2632 3152.7353 3155.7406 3156.2293 3168.9406 3169.2140 3171.0038 3174.9579
redmass: 4.6866 3.9791 6.4823 5.4657 4.8190 3.6958 6.9995 6.0840 5.6384 6.3016 5.7081 6.0381 5.0531 4.4799 2.9127 2.9518 2.9985 6.6257 5.4069 3.2786 3.7669 3.4846 5.8500 6.1630 6.4392 6.9919 6.5358 2.3316 2.0483 3.3389 5.8755 1.7578 1.6658 1.2501 1.5284 1.2616 1.2463 2.5252 2.5238 1.9900 2.0077 1.3290 1.3533 1.3680 1.3709 5.9912 6.0493 1.3026 1.2932 4.0755 2.2271 2.0392 2.6727 1.5698 1.5516 1.3283 1.0504 1.0536 2.2165 1.1432 1.1155 1.3009 2.8476 3.3186 1.4085 1.5581 1.4575 4.2053 7.7739 8.8694 3.5508 2.4076 2.3831 2.4755 2.3394 2.3044 6.9454 6.7818 6.5568 6.2017 5.9918 6.1330 1.0846 1.0847 1.0883 1.0883 1.0923 1.0922 1.0885 1.0883 1.0962 1.0960 1.1015 1.1014 1.0965 1.0975
irintensity: 1.1993 2.7277 0.2534 0.5544 0.0171 0.0008 0.4681 2.2868 0.9112 2.8839 0.1495 1.0590 1.3998 0.4765 3.6951 4.4145 0.4671 4.1000 4.4581 26.1710 55.2205 17.4400 6.2358 0.0154 5.2261 4.8245 1.1905 29.9529 43.0592 27.9465 9.4752 15.1683 94.7513 0.0892 50.8881 3.8149 0.0081 0.3106 3.2177 2.3123 0.2867 0.1813 0.5343 0.4177 0.3458 0.0037 0.5515 0.1674 0.0353 29.0108 4.9971 14.1966 42.0189 15.1173 2.5560 7.3846 0.4590 0.0621 0.9257 11.8031 6.7884 0.1204 144.8692 189.6914 21.3948 13.5558 37.5657 4.5131 1.4180 0.9598 0.7972 2.0153 5.5394 277.5809 179.7861 64.4226 3.6046 12.0256 21.5230 58.6223 132.2047 19.9925 7.4840 3.0996 7.9738 4.5993 29.1541 21.5169 0.5917 7.0291 28.1410 14.2055 22.3508 9.4420 6.5787 0.0022
temp: 298.150 k
press: 1.00000 atm
elementType: 17 7 6 6 6 6 6 6 6 6 6 6 6 6 6 6 6 6 6 6 1 1 1 1 1 1 1 1 1 1 1 1 1 1
symmnumber: 1
zpe: 692164.2 jmol-1
zpe.correction: 0.263631 hartree
zpe.thermalcorrener: 0.280030 hartree
zpe.thermalcorrenthalpy: 0.280974 hartree
zpe.thermalcorrgfe: 0.217771 hartree
zpe.sumelectzpe: -1207.754845 hartree
zpe.sumelectthermal: -1207.738446 hartree
zpe.sumelectthermalent: -1207.737502 hartree
zpe.sumelectthermalfe: -1207.800705 hartree
dipole: 2.6703 -0.0010 -0.0033
dipole: 2.6703
quadrupole: -129.3929 -110.1915 -122.3424
quadrupole: -0.0082 -0.0219 -0.2791
quadrupole: -8.7506 10.4507 -1.7001 -0.0082 -0.0219 -0.2791
hfenergy: -1208.0184761 hartree
pointgroup: C01 [X(C18H14Cl1N1)]
dipole: 1.040557 0.0188418 0.1435188 debye
polarizability: 289.7330538|2.1988802|252.4119718|22.9362022|-10.3912867|129.3918161 unknown
InChI: InChI=1S/C18H14ClN/c19-15-11-13-18(14-12-15)20(16-7-3-1-4-8-16)17-9-5-2-6-10-17/h1-14H
charge 0 multiplicity 1
34 atoms
Cl -5.732743 -0.104187 -0.839102
N  0.291507 0.008927 0.006795
C  -1.127158 -0.017113 -0.191861
C  1.000097 1.260837 -0.009335
C  1.013676 -1.217304 0.217828
C  -1.749426 0.886583 -1.097675
C  -1.940853 -0.947553 0.512729
C  2.270197 1.359254 -0.639424
C  2.068091 -1.275468 1.168858
C  0.441792 2.414639 0.604838
C  0.686255 -2.384969 -0.52356
C  -3.145911 0.867292 -1.291125
C  -3.33635 -0.981488 0.314061
C  2.96583 2.586414 -0.648502
C  2.780169 -2.476884 1.367559
C  1.138823 3.640784 0.578793
C  1.394995 -3.585446 -0.308182
C  -3.924087 -0.070075 -0.58448
C  2.4057 3.736641 -0.0441
C  2.448042 -3.641141 0.635274
H  -1.138809 1.603598 -1.654401
H  -1.481021 -1.643786 1.220363
H  2.702932 0.475918 -1.120071
H  2.321754 -0.381173 1.747187
H  -0.530962 2.344423 1.102438
H  -0.116497 -2.345655 -1.267144
H  -3.61625 1.562037 -1.993105
H  -3.955501 -1.697206 0.862751
H  3.942974 2.646017 -1.140957
H  3.588926 -2.505598 2.106454
H  0.695605 4.520421 1.059106
H  1.131657 -4.476011 -0.889955
H  2.946054 4.689086 -0.057666
H  2.999492 -4.573512 0.796211
