program: Gaussian 09
title: 000266858
version: EM64L-G09RevD.01
frameworkgroup: C1[X(C18H13ClN2O2)]
method: RPBEPBE
basis: SDD
operation: Freq
keyword: #p
keyword: freq=noraman
keyword: PBEPBE/SDD
title: #p freq=noraman PBEPBE/SDD
converged: YES YES NO NO
title: Mulliken charges:
elementType: Cl O O N N C C C C C C C C C C C C C C C C C C H H H H H H H H H H H H H
charge: 0.026981 -0.198834 -0.175325 -0.352460 0.001305 0.399808 0.343496 0.342177 -0.510860 -0.394299 -0.368361 -0.377634 -0.373754 -0.371395 0.569183 -0.170514 -0.375699 -0.206083 -0.209292 -0.206996 -0.206723 -0.250628 -0.253538 0.318879 0.280901 0.265691 0.266899 0.264069 0.266603 0.262100 0.231106 0.231981 0.232559 0.231020 0.233959 0.233679
chargesum: 0.00000
title: Mulliken charges with hydrogens summed into heavy atoms:
elementType: Cl O O N N C C C C C C C C C C C C C C C C C C
charge: 0.026981 -0.198834 -0.175325 -0.352460 0.001305 0.399808 0.343496 0.342177 -0.191981 -0.113398 -0.102670 -0.110736 -0.109685 -0.104791 0.569183 0.091586 -0.375699 0.025023 0.022689 0.025563 0.024297 -0.016669 -0.019859
polarizability: 3.24547695e+02 5.60915092e-01 2.70176504e+02 1.12003588e+01 -1.00543416e+00 1.43317371e+02
1716.lowfreq: -2.8756 -0.0014 -0.0007 -0.0003 3.5678 8.4109 24.9881 29.0655 40.6274
frequency: 24.7623 29.0133 40.6072 48.2814 56.9560 63.7735 71.6764 122.6333 160.3992 168.1699 200.1786 232.6699 246.0685 251.1923 299.5553 311.3378 339.9663 374.9822 406.7056 409.2767 417.9906 442.9133 452.8664 495.7093 512.7894 528.5215 587.4144 612.5065 614.3537 618.7868 655.4602 661.0180 684.3309 697.7869 699.8202 717.1650 720.9699 757.9925 761.8720 807.6317 823.6238 840.7318 847.1189 894.9259 907.7776 911.3046 920.5068 955.9124 960.0687 973.6739 976.0924 986.4445 987.0523 991.8468 992.2528 1014.2817 1024.9542 1027.1233 1084.1515 1086.4407 1115.8085 1153.1794 1172.6738 1173.2514 1176.1160 1185.1819 1190.4818 1212.2015 1250.8570 1271.1551 1296.9702 1311.9125 1329.9896 1357.7788 1375.0946 1381.7418 1384.6691 1418.9196 1441.1850 1446.4718 1469.9636 1479.5480 1480.8278 1555.2100 1586.2731 1591.8017 1601.2888 1603.2922 1615.4872 3130.4304 3131.3390 3136.8033 3137.5535 3150.6291 3151.0093 3157.1033 3157.9525 3159.0544 3171.0601 3171.6987 3177.1508 3180.3219
redmass: 7.8267 4.3954 10.4312 9.4597 5.4663 4.5200 4.5446 5.2198 8.1081 6.8738 10.8531 5.8917 6.1538 5.7745 6.4086 4.9575 9.4634 6.3341 2.8900 2.9359 4.3480 5.1154 6.1070 4.3962 3.8497 4.3723 5.6942 6.2098 6.0790 6.7566 6.4341 7.4245 4.4476 2.1488 1.9927 7.8516 6.3809 1.8697 1.6548 5.2142 1.4555 1.2567 1.2506 2.1805 1.6970 1.4298 1.9737 3.5223 1.4818 1.3741 1.3784 6.0806 6.0996 1.3049 1.3100 6.0552 2.1893 2.0329 1.5588 1.5401 2.1813 1.5119 1.0559 1.0506 1.9680 1.1178 1.3680 10.3204 1.4817 3.9638 2.3358 1.5002 1.6016 3.6945 8.7241 8.5789 9.1862 4.9201 2.3871 2.3541 2.9941 2.3350 2.3372 7.9839 6.3778 6.5601 6.4272 6.0329 6.3097 1.0848 1.0849 1.0882 1.0881 1.0926 1.0925 1.0964 1.0964 1.0886 1.1016 1.1016 1.0954 1.0931
irintensity: 1.8875 0.8465 0.2225 0.3237 0.6961 1.3068 0.0225 0.5073 0.9914 1.4242 0.2817 1.9459 1.6793 1.0979 0.3545 1.9583 3.2335 0.9592 2.5944 1.5026 2.4710 1.5652 2.3432 17.8717 17.0900 41.5767 17.0790 0.0642 4.7501 10.3147 5.0623 7.2232 7.1733 48.2057 50.6175 10.2736 2.8813 6.4021 86.9298 23.1936 24.1334 0.2831 1.2721 8.5024 11.3943 1.3149 1.1348 0.6082 1.0690 0.5534 0.1978 0.0132 0.0682 0.0590 0.0858 27.6274 3.1190 12.8061 15.5184 2.8755 16.9627 3.2135 0.3706 0.0465 3.4349 5.4409 2.7887 237.4804 14.9336 126.7409 167.5434 4.7391 73.9213 15.0348 59.0714 50.2171 2.8533 9.9895 4.0631 10.4905 334.6353 111.4329 123.1387 1.7506 13.3438 20.3435 134.1129 93.0728 0.6249 5.8866 4.4787 4.1482 2.5821 20.6820 19.0246 24.5979 16.3423 2.7855 17.8099 14.2639 0.1346 7.4656
temp: 298.150 k
press: 1.00000 atm
elementType: 17 8 8 7 7 6 6 6 6 6 6 6 6 6 6 6 6 6 6 6 6 6 6 1 1 1 1 1 1 1 1 1 1 1 1 1
symmnumber: 1
zpe: 694754.2 jmol-1
zpe.correction: 0.264618 hartree
zpe.thermalcorrener: 0.283799 hartree
zpe.thermalcorrenthalpy: 0.284743 hartree
zpe.thermalcorrgfe: 0.214348 hartree
zpe.sumelectzpe: -1412.044063 hartree
zpe.sumelectthermal: -1412.024882 hartree
zpe.sumelectthermalent: -1412.023938 hartree
zpe.sumelectthermalfe: -1412.094333 hartree
dipole: 6.3445 -2.3854 -1.5363
dipole: 6.9500
quadrupole: -153.2908 -127.0447 -139.2902
quadrupole: 8.6797 5.1829 -6.0206
quadrupole: -13.4155 12.8305 0.5850 8.6797 5.1829 -6.0206
hfenergy: -1412.3086807 hartree
pointgroup: C01 [X(C18H13Cl1N2O2)]
dipole: 2.2922735 -1.1567424 -0.9402564 debye
polarizability: 323.2576798|-10.8742928|264.9268382|7.1197248|28.6634877|149.8570518 unknown
InChI: InChI=1S/C18H13ClN2O2/c19-17-12-11-16(13-18(17)21(22)23)20(14-7-3-1-4-8-14)15-9-5-2-6-10-15/h1-13H
charge 0 multiplicity 1
36 atoms
Cl -5.21217 -0.556443 -0.599058
O  -3.004181 2.037474 2.263358
O  -4.686749 2.041674 0.724685
N  0.84899 -0.117465 -0.179738
N  -3.553443 1.6243 1.167954
C  -0.568433 -0.1955 -0.267743
C  1.499035 1.145195 0.079536
C  1.656523 -1.302525 -0.332349
C  -1.39157 0.687113 0.475358
C  -1.202052 -1.159692 -1.105908
C  2.565843 1.216783 1.012457
C  1.274713 -2.520954 0.289739
C  1.090022 2.319493 -0.605839
C  2.852914 -1.254587 -1.095302
C  -2.796858 0.627945 0.363491
C  -2.602923 -1.235236 -1.18192
C  -3.422619 -0.33964 -0.461214
C  3.212785 2.447541 1.252884
C  2.072359 -3.674614 0.13628
C  1.732377 3.548784 -0.347576
C  3.65183 -2.409629 -1.230946
C  2.798215 3.620777 0.580015
C  3.265915 -3.626994 -0.621998
H  -0.959901 1.42413 1.156733
H  -0.593583 -1.849096 -1.697445
H  2.880142 0.31257 1.543521
H  0.364755 -2.557992 0.897865
H  0.278445 2.266149 -1.33919
H  3.149695 -0.316458 -1.575178
H  -3.074672 -1.988143 -1.819903
H  4.033125 2.491577 1.977681
H  1.768421 -4.607544 0.623767
H  1.406906 4.448598 -0.881015
H  4.572159 -2.360298 -1.823353
H  3.296931 4.575823 0.775485
H  3.886257 -4.522416 -0.733838
