program: Gaussian 09
title: 000266857
version: EM64L-G09RevD.01
frameworkgroup: C1[X(C18H12Cl2N2O2)]
method: RPBEPBE
basis: SDD
operation: Freq
keyword: #p
keyword: freq=noraman
keyword: PBEPBE/SDD
title: #p freq=noraman PBEPBE/SDD
converged: YES YES NO NO
title: Mulliken charges:
elementType: Cl Cl O O N N C C C C C C C C C C C C C C C C C C H H H H H H H H H H H H
charge: 0.019571 0.046863 -0.195937 -0.174102 -0.340328 0.000277 0.536590 0.361008 0.347647 -0.490056 -0.392382 -0.367047 -0.370143 -0.362733 -0.366713 0.597752 -0.172162 -0.386901 -0.208567 -0.210074 -0.206419 -0.203762 -0.254594 -0.251412 0.322790 0.267460 0.269835 0.252766 0.257071 0.286070 0.230064 0.230769 0.229436 0.231470 0.232195 0.233698
chargesum: 0.00000
title: Mulliken charges with hydrogens summed into heavy atoms:
elementType: Cl Cl O O N N C C C C C C C C C C C C C C C C C C
charge: 0.019571 0.046863 -0.195937 -0.174102 -0.340328 0.000277 0.536590 0.361008 0.347647 -0.167266 -0.392382 -0.099587 -0.100308 -0.109967 -0.109642 0.597752 0.113908 -0.386901 0.021498 0.020695 0.023017 0.027709 -0.022400 -0.017714
polarizability: 3.32333878e+02 1.30124071e+00 2.76934747e+02 -1.82027434e+00 5.20638685e+00 1.64299611e+02
1716.lowfreq: -6.7523 0.0013 0.0025 0.0026 1.8040 5.0902 21.9852 33.2376 38.3082
frequency: 21.8983 33.2133 38.3040 42.9887 51.5057 59.0267 73.8359 78.9845 150.8893 160.4381 173.7015 196.8815 210.6025 228.6045 245.6439 255.2490 294.7576 313.2640 341.9590 368.4274 405.9884 408.9506 420.8376 452.0267 457.6856 498.4006 515.6757 538.1414 565.1063 582.3090 612.0973 614.8291 636.5932 657.1462 678.5115 693.4224 696.0657 698.0211 717.1498 734.7934 757.2375 760.7594 817.0626 836.9246 843.5050 862.1572 895.3672 909.5420 912.4741 923.2723 966.3510 971.4121 974.2707 986.1333 986.3476 990.2561 991.5591 1025.0704 1027.4152 1050.8933 1085.4274 1088.6536 1117.9677 1172.6545 1173.2259 1177.4581 1186.8370 1191.0473 1204.6804 1242.4401 1269.8145 1277.4422 1311.4133 1325.3091 1340.6455 1370.6073 1379.2622 1386.5331 1397.9780 1440.0956 1446.2742 1458.1171 1478.9367 1480.5770 1534.4328 1585.1754 1586.7975 1594.0099 1603.5109 1613.1401 3129.0693 3131.1558 3135.2357 3137.4929 3148.6268 3150.9616 3156.8856 3158.6621 3170.5122 3171.7466 3173.9213 3179.2677
redmass: 8.3694 8.6124 5.1274 13.0001 5.7478 5.1051 6.5740 5.0962 8.5383 7.2783 13.0139 11.4230 7.0335 5.6289 6.2501 5.8063 15.0189 5.2480 9.1384 10.5926 2.8845 2.9031 6.6585 3.8023 5.5842 4.2338 4.4719 5.9130 7.2705 7.7797 6.2407 6.4184 6.0957 7.3934 5.7772 3.2238 2.4141 2.4879 6.3530 10.7796 1.7669 1.6871 6.9439 1.2574 1.2569 1.4070 2.3626 1.4149 1.4735 2.1565 5.5566 1.3782 1.4064 6.0972 6.0905 1.3106 1.3076 2.2265 2.0301 6.2307 1.5632 1.5555 2.0377 1.0583 1.0515 2.3424 1.1173 1.3434 11.3024 1.2526 4.6262 3.6605 1.7058 1.4762 2.9734 8.5148 8.7686 9.3540 10.6650 2.3718 2.4615 3.3338 2.3057 2.3246 9.6110 6.9223 6.9387 6.6705 6.0345 6.2202 1.0849 1.0849 1.0881 1.0882 1.0929 1.0927 1.0961 1.0960 1.1015 1.1015 1.0914 1.0929
irintensity: 0.8458 0.3866 1.3124 0.0815 0.2455 1.3886 0.3620 0.2724 0.6280 1.5478 0.3855 0.9416 1.9020 3.1679 1.0901 1.0394 0.1636 1.8969 1.6811 2.6874 2.6756 1.1596 2.5036 12.1444 4.9271 22.7540 8.2917 27.8076 21.8459 12.5712 0.0870 1.4168 8.9903 10.9108 3.4153 11.9567 37.8154 40.5889 2.1959 10.1308 8.1640 92.8190 45.2789 0.3132 0.4678 9.4698 3.4129 3.2675 7.7168 12.4726 15.9468 0.4878 0.2322 0.1507 0.3912 0.0709 0.0358 2.1421 13.2770 66.3147 12.6295 6.6870 15.5393 0.3965 0.1077 4.5991 4.8099 2.3328 294.8463 1.9591 78.3443 108.5706 18.0545 10.2691 78.4068 17.0553 32.0111 1.4725 79.3992 9.6451 69.5472 260.8616 123.0797 98.3561 33.3100 22.9590 42.7451 4.3937 94.1781 22.2813 6.3011 4.6955 3.0662 2.9771 20.1579 21.2607 26.7152 14.2597 18.8687 14.8794 7.2321 0.2981
temp: 298.150 k
press: 1.00000 atm
elementType: 17 17 8 8 7 7 6 6 6 6 6 6 6 6 6 6 6 6 6 6 6 6 6 6 1 1 1 1 1 1 1 1 1 1 1 1
symmnumber: 1
zpe: 668568.6 jmol-1
zpe.correction: 0.254644 hartree
zpe.thermalcorrener: 0.275189 hartree
zpe.thermalcorrenthalpy: 0.276133 hartree
zpe.thermalcorrgfe: 0.202449 hartree
zpe.sumelectzpe: -1871.426142 hartree
zpe.sumelectthermal: -1871.405597 hartree
zpe.sumelectthermalent: -1871.404653 hartree
zpe.sumelectthermalfe: -1871.478337 hartree
dipole: 4.7355 -1.4367 1.4056
dipole: 5.1444
quadrupole: -160.3493 -145.4729 -150.5291
quadrupole: 10.0114 -12.2565 8.5226
quadrupole: -8.2322 6.6442 1.5880 10.0114 -12.2565 8.5226
hfenergy: -1871.6807858 hartree
pointgroup: C01 [X(C18H12Cl2N2O2)]
dipole: 1.8795981 0.5887746 -0.4657133 debye
polarizability: 325.8080119|14.4049719|265.778901|28.7172592|-33.3646068|181.9813244 unknown
InChI: InChI=1S/C18H12Cl2N2O2/c19-15-11-16(20)18(22(23)24)12-17(15)21(13-7-3-1-4-8-13)14-9-5-2-6-10-14/h1-12H
charge 0 multiplicity 1
36 atoms
Cl 0.288726 1.640294 -2.823177
Cl -4.915888 0.309307 -1.834548
O  -3.199954 -2.193586 1.47482
O  -4.916642 -0.809226 0.893092
N  0.943268 0.09247 -0.149698
N  -3.69739 -1.208342 0.800803
C  -0.423134 0.14747 -0.539329
C  1.693761 1.31155 0.020972
C  1.495274 -1.171437 0.275076
C  -1.40892 -0.524122 0.226093
C  -0.881277 0.84642 -1.697496
C  3.07935 1.344241 -0.28521
C  2.331892 -1.250736 1.419324
C  1.0543 2.485704 0.494695
C  1.195266 -2.351859 -0.454993
C  -2.775767 -0.483182 -0.112696
C  -2.24401 0.902058 -2.039295
C  -3.209673 0.243869 -1.251558
C  3.810551 2.536837 -0.1139
C  2.861456 -2.495874 1.819749
C  1.791423 3.679922 0.646274
C  1.716237 -3.593791 -0.03635
C  3.172566 3.713419 0.348064
C  2.555104 -3.674282 1.099809
H  -1.112609 -1.092067 1.112051
H  3.571163 0.442778 -0.664061
H  2.559837 -0.345043 1.98994
H  -0.011056 2.463204 0.748396
H  0.563623 -2.292174 -1.347518
H  -2.554321 1.430764 -2.944118
H  4.878904 2.551746 -0.356621
H  3.503237 -2.546203 2.706278
H  1.286188 4.581525 1.009942
H  1.47563 -4.497879 -0.606267
H  3.74323 4.639749 0.471964
H  2.961853 -4.639323 1.419495
