program: Gaussian 09
title: 000266855
version: EM64L-G09RevD.01
frameworkgroup: C1[X(C17H19NO3S)]
method: RPBEPBE
basis: SDD
operation: Freq
keyword: #p
keyword: freq=noraman
keyword: PBEPBE/SDD
title: #p freq=noraman PBEPBE/SDD
converged: NO YES NO NO
title: Mulliken charges:
elementType: S O O O N C C C C C C C C C C C C C C C C C H H H H H H H H H H H H H H H H H H H
charge: 0.902226 -0.446598 -0.504762 -0.554249 -0.360229 -0.396008 -0.455222 -0.398420 -0.271154 0.185976 0.426318 -0.278815 -0.408950 -0.071258 -0.240070 -0.236110 -0.233989 -0.242094 -0.362670 -0.369206 0.448133 -0.798083 0.205696 0.237971 0.240705 0.240821 0.226941 0.192791 0.213659 0.261781 0.235605 0.371977 0.234951 0.232600 0.279680 0.290358 0.245430 0.246137 0.232613 0.242646 0.232873
chargesum: 0.00000
title: Mulliken charges with hydrogens summed into heavy atoms:
elementType: S O O O N C C C C C C C C C C C C C C C C C
charge: 0.902226 -0.074621 -0.504762 -0.554249 -0.360229 0.047659 0.026303 0.021312 -0.057495 0.185976 0.426318 -0.017034 -0.173345 -0.071258 -0.005119 -0.003510 0.045691 0.048264 -0.117241 -0.123070 0.448133 -0.089951
polarizability: 3.49971956e+02 1.85092477e+01 2.22601099e+02 -5.17634079e+00 1.14162420e+01 1.48265522e+02
1716.lowfreq: -31.6075 -7.9815 -5.5002 0.0011 0.0018 0.0026 7.4713 20.1901 34.4082
frequency: -31.5850 20.0427 34.3989 37.7422 71.8470 88.1492 105.4771 117.1989 137.6271 149.9690 181.7042 199.3460 218.5518 227.9426 250.2550 274.1453 290.3713 307.2241 313.1790 337.7715 351.7887 373.6969 390.0331 399.4586 405.7447 429.8559 476.1650 508.8598 529.6289 547.2981 560.6568 573.1741 591.9170 621.7999 649.5896 662.8355 693.1250 707.2034 755.9644 768.1114 770.0638 783.7896 793.3588 822.6549 824.8395 844.3853 850.3503 882.2499 915.8860 925.0122 938.8582 958.9953 959.7400 974.6837 983.8009 990.1830 993.1677 994.3067 1030.4285 1049.1340 1052.1759 1053.2275 1081.3326 1096.7279 1117.7525 1119.8383 1161.7463 1173.4276 1185.7406 1201.1952 1216.6078 1218.8681 1244.2815 1262.6405 1276.0889 1296.0278 1297.8041 1331.5710 1341.8003 1356.6680 1370.3004 1379.7076 1386.2571 1392.3270 1394.5083 1399.8679 1428.9626 1440.8464 1449.8362 1463.0627 1465.1314 1470.2080 1473.6842 1474.0478 1565.8326 1592.2705 1595.3802 1598.0094 2968.7133 2974.5530 2981.0346 2985.9214 3020.1330 3036.9906 3039.0140 3050.8098 3063.7658 3093.7880 3124.0061 3137.1663 3138.7249 3140.9483 3158.9327 3161.4556 3167.4860 3179.2519 3238.4373
redmass: 1.0128 5.5728 3.8662 4.9369 5.2441 4.8802 4.5682 5.1651 5.7044 4.5804 7.4234 9.6322 3.9823 7.0042 4.0856 4.8301 3.9543 4.4085 4.7717 3.5475 3.4081 3.5770 3.9812 3.2255 2.8935 6.7656 4.1063 3.1353 3.3677 4.8372 2.8629 3.0306 5.5339 6.9586 2.4396 1.4745 3.6531 3.3185 2.5754 3.0065 2.6946 5.0409 3.0354 1.4248 2.8230 1.9660 1.2545 1.5587 9.8845 2.5848 2.7552 1.3182 1.4568 3.0882 1.3705 1.4183 1.3621 5.1728 3.5318 1.6028 2.4149 2.3285 2.3212 2.1252 2.1217 1.3048 1.3341 1.0764 1.1396 1.5641 2.1030 2.9760 1.7848 1.3918 1.2797 1.2163 1.2521 1.8265 1.3056 1.4138 2.1430 5.4125 1.4700 2.9168 1.3930 1.2186 2.0767 1.0982 1.1123 1.3031 1.6900 1.1052 1.6766 1.2822 6.0678 6.8236 6.0437 6.2109 1.0629 1.0623 1.0392 1.0640 1.0869 1.0986 1.0962 1.1000 1.0945 1.1002 1.0871 1.0891 1.0894 1.0899 1.0955 1.0958 1.0964 1.0978 1.0711
irintensity: 0.5018 0.6349 0.1051 1.1498 1.5623 1.8654 1.4040 0.3078 3.3280 0.9578 15.4284 0.6389 3.2331 10.1972 20.4002 2.7372 5.8935 1.4589 2.6276 7.0482 4.8871 1.6878 5.4507 5.7637 0.8807 55.6750 3.7516 61.4758 33.7908 4.6619 7.9625 10.5776 39.5433 0.5681 37.2757 71.0633 10.6458 1.6330 11.8117 5.3569 77.2898 15.3339 35.7813 32.1126 13.5425 12.8605 7.9267 6.6285 54.2170 26.2733 17.9109 1.1688 3.0131 25.1347 0.4751 1.1226 0.4544 6.2331 3.3894 21.2659 14.9551 28.1512 18.0240 3.3226 5.7477 9.1680 7.1067 0.6835 17.9968 14.2096 4.6994 10.1086 6.6475 3.7813 24.4937 2.8626 6.8473 2.9597 8.2089 5.6176 9.3784 0.3956 10.8214 8.1004 14.8078 16.9857 2.7825 7.9967 18.0305 25.1555 3.4007 17.7268 30.2014 13.2700 1.9903 0.5719 8.6085 9.1862 27.2777 11.0911 24.9256 35.0567 57.7212 22.3358 42.1426 19.5297 19.7755 13.6657 5.1973 12.0295 9.3192 11.7794 33.0402 6.2517 7.5266 11.1760 243.2138
temp: 298.150 k
press: 1.00000 atm
elementType: 16 8 8 8 7 6 6 6 6 6 6 6 6 6 6 6 6 6 6 6 6 6 1 1 1 1 1 1 1 1 1 1 1 1 1 1 1 1 1 1 1
symmnumber: 1
zpe: 847749.4 jmol-1
zpe.correction: 0.322891 hartree
zpe.thermalcorrener: 0.343035 hartree
zpe.thermalcorrenthalpy: 0.343979 hartree
zpe.thermalcorrgfe: 0.273574 hartree
zpe.sumelectzpe: -1335.909259 hartree
zpe.sumelectthermal: -1335.889114 hartree
zpe.sumelectthermalent: -1335.888170 hartree
zpe.sumelectthermalfe: -1335.958575 hartree
dipole: 4.5388 0.1312 -6.0910
dipole: 7.5972
quadrupole: -103.0058 -134.2779 -149.7464
quadrupole: 6.5010 2.2606 -0.7256
quadrupole: 26.0042 -5.2678 -20.7364 6.5010 2.2606 -0.7256
hfenergy: -1336.2321494 hartree
pointgroup: C01 [X(C17H19N1O3S1)]
dipole: -1.7149786 -0.2893503 2.4308632 debye
polarizability: 331.9065329|-43.0568219|236.9154073|-22.84721|20.7609541|152.0166364 unknown
InChI: InChI=1S/C17H19NO3S/c1-13-8-10-14(11-9-13)22(20,21)18-12-4-7-17(19)15-5-2-3-6-16(15)18/h2-3,5-6,8-11,17,19H,4,7,12H2,1H3
charge 0 multiplicity 1
41 atoms
S  -0.384918 -0.151153 -1.138035
O  2.969232 1.557141 -1.057023
O  -0.510701 -1.418354 -2.14437
O  0.244856 1.270829 -1.704086
N  0.600799 -0.842388 0.452532
C  1.250101 1.483601 1.498285
C  0.52429 0.123342 1.584589
C  2.783074 1.37546 1.43137
C  3.347801 0.76808 0.124426
C  1.8490 -1.41385 0.021727
C  3.111099 -0.734703 -0.087392
C  1.747733 -2.786364 -0.342546
C  4.229482 -1.502558 -0.498812
C  -2.078297 0.252623 -0.435794
C  2.873888 -3.517594 -0.763192
C  4.128276 -2.870848 -0.831664
C  -2.950381 -0.812631 -0.154118
C  -2.429168 1.602397 -0.273449
C  -4.23551 -0.495613 0.336782
C  -3.722362 1.891615 0.214382
C  -4.637147 0.853339 0.534921
C  -6.012364 1.176565 1.088262
H  0.96664 2.057175 2.403284
H  0.878906 2.060946 0.630656
H  0.921265 -0.452126 2.446072
H  -0.551892 0.283941 1.783987
H  3.211077 2.392302 1.517288
H  3.161972 0.787851 2.293771
H  4.443626 0.905911 0.164936
H  0.762861 -3.25547 -0.268365
H  5.199712 -0.998901 -0.585168
H  2.006029 1.420511 -1.318191
H  2.774488 -4.573935 -1.033482
H  5.018855 -3.422155 -1.152821
H  -2.644177 -1.847978 -0.332018
H  -1.72196 2.391697 -0.548772
H  -4.937743 -1.306389 0.561917
H  -4.025243 2.937228 0.340805
H  -6.754416 0.410244 0.805332
H  -5.989786 1.219478 2.194479
H  -6.374997 2.155338 0.729898
