program: Gaussian 09
title: 000266854
version: EM64L-G09RevD.01
frameworkgroup: C1[X(C17H17NO6S)]
method: RPBEPBE
basis: SDD
operation: Freq
keyword: #p
keyword: freq=noraman
keyword: PBEPBE/SDD
title: #p freq=noraman PBEPBE/SDD
converged: YES YES NO NO
title: Mulliken charges:
elementType: S O O O O O O N C C C C C C C C C C C C C C C C C H H H H H H H H H H H H H H H H H
charge: 0.966600 -0.504361 -0.520568 -0.401371 -0.429513 -0.276108 -0.247835 -0.511188 -0.401267 0.391195 -0.020892 -0.485038 0.191371 -0.358753 -0.255961 -0.258449 0.448901 -0.330819 -0.367871 -0.383229 -0.216725 0.232727 -0.236189 0.119734 -0.799867 0.243929 0.265268 0.244063 0.342527 0.247085 0.284813 0.328574 0.243279 0.246647 0.276512 0.232976 0.236689 0.228128 0.244147 0.230510 0.375414 0.384918
chargesum: 0.00000
title: Mulliken charges with hydrogens summed into heavy atoms:
elementType: S O O O O O O N C C C C C C C C C C C C C C C C C
charge: 0.966600 -0.504361 -0.520568 -0.025957 -0.044595 -0.276108 -0.247835 -0.511188 0.107930 0.391195 -0.020892 0.101552 0.191371 -0.111668 0.028852 0.070125 0.448901 -0.054308 -0.124592 -0.136582 0.016251 0.232727 0.000500 0.119734 -0.097082
polarizability: 3.02493583e+02 1.67671912e+01 2.49868563e+02 1.45496348e+01 -2.21556193e+01 1.76027407e+02
1716.lowfreq: -21.2741 -7.5823 -6.0334 -0.0020 -0.0015 -0.0003 1.7034 20.0656 28.3991
frequency: -21.0856 19.8345 28.2045 34.8959 43.2650 50.7882 60.1906 64.4801 82.3549 94.3889 109.0292 121.1292 131.8868 139.0238 159.5760 211.9327 222.5291 225.8004 233.8496 246.5953 278.6212 296.2690 310.4310 332.1436 370.1859 378.5355 394.7586 410.0455 411.2599 424.1944 454.1567 466.8712 488.0077 510.0887 528.4369 547.3060 575.6524 581.4456 587.4208 593.7780 611.8423 620.9148 635.7237 680.2526 709.1893 715.2686 762.2156 775.1418 777.5291 795.5345 807.7359 816.5649 831.2988 856.5394 882.4350 913.5248 951.5048 966.6326 967.1916 985.8022 991.0693 993.7668 994.8317 1002.3004 1006.3308 1020.6741 1040.2696 1048.9133 1049.9525 1057.6361 1078.3256 1121.7840 1125.3031 1159.4595 1174.8728 1191.2779 1214.0192 1218.5321 1239.1908 1262.7243 1263.5130 1303.6413 1314.9523 1322.5138 1336.2332 1374.4119 1379.2034 1380.0200 1392.4199 1398.0299 1426.8932 1436.4276 1460.6239 1470.9029 1473.6615 1474.9361 1476.9266 1569.7872 1591.5018 1593.5605 1594.9799 1636.7908 1653.6224 2980.3629 2988.1102 3002.9131 3061.3269 3062.8336 3071.1235 3091.6171 3130.9363 3134.2387 3135.4378 3147.5649 3152.0375 3161.3291 3162.4754 3181.0983 3516.1766 3527.8324
redmass: 1.0173 5.8864 5.9522 5.8226 7.3396 4.0943 4.7326 10.0347 7.8748 6.6823 4.4654 5.5205 5.7225 5.9863 6.3653 6.3669 9.4294 6.1749 8.1172 5.0379 3.2314 4.3219 3.8213 7.2802 4.2982 3.9899 6.4490 3.0369 4.8080 4.6859 4.2359 2.9356 2.7401 3.2956 3.8992 4.8907 2.9402 5.4008 1.3521 5.1731 5.8746 6.9249 1.5420 3.6647 3.3552 4.5826 2.6695 3.3807 1.9826 4.3140 9.6311 3.6440 1.3618 1.2397 1.4843 2.7675 9.5965 1.3563 1.3522 1.4779 1.5839 3.3761 1.3615 4.6718 4.2940 2.3558 2.3468 1.5953 2.5023 3.6729 2.3286 1.6941 1.3415 1.6353 1.1038 1.1314 1.1445 3.0659 1.4582 1.5350 1.5731 1.2582 2.2423 2.5598 1.3714 8.8439 7.0164 1.6723 2.7560 1.2192 2.2436 1.0739 1.2046 1.1022 1.1140 2.0415 2.2306 6.9437 6.3265 6.3418 6.2478 8.5240 7.7056 1.0388 1.0634 1.0638 1.0985 1.0949 1.0979 1.1001 1.0861 1.0888 1.0893 1.0912 1.0975 1.0963 1.0963 1.0971 1.0639 1.0640
irintensity: 0.5777 1.0296 0.9469 1.2433 2.6040 1.6020 0.3577 0.9771 2.7902 2.0106 4.4311 0.2400 1.9358 2.8837 2.0691 3.2690 4.3225 1.8323 5.8764 1.6609 2.2926 3.7905 1.5945 2.2397 4.7671 2.2578 2.5556 1.1417 13.7777 30.0637 101.7356 35.8033 37.6104 93.1865 13.2060 21.9019 17.5565 30.4409 67.0736 45.9548 27.7323 0.3572 145.1297 90.0997 1.3632 8.7683 33.2681 23.9069 18.6960 22.2112 69.8033 18.0442 32.0772 4.4658 2.8962 5.5080 73.8643 6.7641 1.7362 0.5501 6.4236 6.3958 4.7148 170.3047 138.7017 9.7384 14.4917 25.4631 14.5519 67.5528 277.9413 30.7084 8.5475 93.7613 1.9564 13.5377 5.7823 5.4133 16.8490 2.3651 2.8567 1.6653 81.1797 62.1832 23.3885 6.7773 1.8971 79.5376 11.5657 15.0187 14.3742 40.4587 14.6179 15.6449 14.5242 23.3880 114.0449 27.7036 2.0800 7.6076 11.0842 219.7737 217.6325 27.9301 14.2646 29.5827 4.1076 18.2482 13.9492 14.7552 3.9100 24.2631 3.0142 12.0004 18.2251 15.2112 9.2605 10.6479 26.8233 51.2932
temp: 298.150 k
press: 1.00000 atm
elementType: 16 8 8 8 8 8 8 7 6 6 6 6 6 6 6 6 6 6 6 6 6 6 6 6 6 1 1 1 1 1 1 1 1 1 1 1 1 1 1 1 1 1
symmnumber: 1
zpe: 814097.1 jmol-1
zpe.correction: 0.310073 hartree
zpe.thermalcorrener: 0.334261 hartree
zpe.thermalcorrenthalpy: 0.335205 hartree
zpe.thermalcorrgfe: 0.254058 hartree
zpe.sumelectzpe: -1560.183351 hartree
zpe.sumelectthermal: -1560.159163 hartree
zpe.sumelectthermalent: -1560.158219 hartree
zpe.sumelectthermalfe: -1560.239366 hartree
dipole: 2.0522 -3.1456 4.1509
dipole: 5.5979
quadrupole: -127.3796 -141.2106 -151.7421
quadrupole: -2.1442 -0.0339 -3.4154
quadrupole: 12.7312 -1.0999 -11.6313 -2.1442 -0.0339 -3.4154
hfenergy: -1560.4934242 hartree
pointgroup: C01 [X(C17H17N1O6S1)]
dipole: -1.2167893 -1.0217894 -1.525085 debye
polarizability: 282.4056835|-27.6233453|271.9159208|26.0410517|2.8686752|174.0679485 unknown
InChI: InChI=1S/C17H17NO6S/c1-12-6-8-13(9-7-12)25(23,24)18(11-10-16(19)20)15-5-3-2-4-14(15)17(21)22/h2-9,19,21H,10-11H2,1H3
charge 0 multiplicity 1
42 atoms
S  -0.152967 0.408391 0.942401
O  0.24506 1.961048 1.18839
O  0.150768 -0.755933 2.036484
O  1.879751 4.323308 -0.975165
O  3.50332 -1.680252 2.193654
O  -0.255894 3.574645 -1.460813
O  3.055483 0.241315 0.986911
N  0.637963 -0.159361 -0.645302
C  0.655326 0.830011 -1.739542
C  1.200708 -1.458565 -0.715253
C  -1.993377 0.356734 0.524133
C  1.66066 1.996222 -1.526924
C  2.212087 -1.924464 0.186145
C  0.704912 -2.350673 -1.706981
C  -2.702395 -0.817734 0.823492
C  -2.575109 1.496709 -0.055948
C  -4.723579 0.275455 -0.076672
C  2.645122 -3.27411 0.110672
C  -4.080093 -0.844563 0.515883
C  -3.954579 1.436199 -0.35681
C  1.192874 -3.667664 -1.810641
C  0.965688 3.327556 -1.320134
C  2.15141 -4.141539 -0.882985
C  2.907753 -0.997416 1.124691
C  -6.211968 0.244164 -0.372443
H  0.915276 0.265028 -2.651612
H  -0.357539 1.250002 -1.896789
H  2.336212 2.106461 -2.397235
H  2.301595 1.785476 -0.653009
H  -0.088342 -1.998703 -2.375715
H  -2.197724 -1.665642 1.297676
H  -1.980486 2.394161 -0.26054
H  -4.662413 -1.744978 0.743101
H  -4.43722 2.307614 -0.81376
H  3.392623 -3.619784 0.829661
H  0.80143 -4.332536 -2.588608
H  2.509177 -5.174847 -0.936068
H  -6.564605 -0.781364 -0.578145
H  -6.79129 0.624025 0.49135
H  -6.466801 0.876478 -1.240579
H  1.390836 5.176111 -0.817248
H  3.954345 -1.012882 2.777579
