program: Gaussian 09
title: 000266847
version: EM64L-G09RevD.01
frameworkgroup: C1[X(C16H18O4)]
method: RPBEPBE
basis: SDD
operation: Freq
keyword: #pfreq=noraman
keyword: PBEPBE/SDD
title: #p freq=noraman PBEPBE/SDD
converged: YES YES NO NO
title: Mulliken charges:
elementType: O O O O C C C C C C C C C C C C C C C C H H H H H H H H H H H H H H H H H H
charge: -0.289473 -0.289348 -0.265989 -0.265991 0.214355 0.214179 0.177548 0.177680 -0.363755 -0.363879 -0.514275 -0.514283 0.350673 0.350702 -0.407918 -0.407916 -0.533168 -0.533347 -0.536390 -0.536390 0.245878 0.245860 0.276097 0.276084 0.239804 0.239796 0.231176 0.263753 0.226704 0.226756 0.231144 0.263893 0.245228 0.220265 0.219531 0.220261 0.219531 0.245225
chargesum: 0.00000
title: Mulliken charges with hydrogens summed into heavy atoms:
elementType: O O O O C C C C C C C C C C C C C C C C
charge: -0.289473 -0.289348 -0.265989 -0.265991 0.214355 0.214179 0.177548 0.177680 -0.117876 -0.118020 -0.238178 -0.238199 0.350673 0.350702 -0.168114 -0.168120 0.188465 0.188446 0.148634 0.148626
polarizability: 3.02013528e+02 -3.42973723e-03 1.72740137e+02 9.22563685e+00 2.84906242e-02 1.26966559e+02
1716.lowfreq: -8.7721 -7.0805 -6.3226 -0.0009 -0.0005 -0.0004 32.8048 37.6438 55.5709
frequency: 32.7638 37.6378 55.5109 64.5474 78.1057 89.3309 103.9520 138.1462 142.1416 156.7608 169.5474 181.3996 191.3905 214.1913 218.9277 236.5368 240.7411 252.8706 285.2728 297.4126 338.0649 347.0250 375.2355 405.4899 455.9881 466.6381 499.3363 525.2634 546.8037 557.2167 619.5615 625.6189 631.2972 645.9263 693.4945 701.6832 721.9955 740.5851 788.9171 802.1723 841.4469 861.6508 873.6925 874.0225 929.4820 939.0485 968.9272 976.0800 988.0069 1012.3450 1023.7240 1094.9237 1102.7768 1107.8012 1110.4336 1110.5568 1118.9801 1139.4390 1142.7453 1154.3240 1156.3293 1172.6497 1176.1923 1223.9148 1233.3819 1265.1263 1266.3128 1281.3863 1350.5368 1365.8312 1405.3175 1407.3726 1430.9554 1434.2908 1443.1110 1447.3620 1452.4346 1453.3988 1465.6013 1465.6160 1472.3667 1473.3397 1476.4772 1478.1948 1478.9203 1503.4957 1553.8010 1560.9496 1620.7538 1622.1652 2957.7156 2957.9849 2988.7262 2988.8448 3044.8590 3044.8774 3099.3617 3099.9884 3107.3608 3107.7817 3123.7180 3123.8084 3129.3449 3132.4581 3167.6999 3168.1310 3180.7071 3180.7797
redmass: 4.4290 4.6432 4.3393 2.6446 3.2658 3.6637 2.8561 3.7589 1.8946 1.6625 2.1587 1.4203 3.1510 1.9843 1.8795 1.6210 2.0783 5.1850 3.5763 3.6237 4.3905 4.4951 5.3039 4.6424 3.8143 5.0918 3.5074 5.7119 5.2207 4.9119 3.5981 3.7252 5.0760 4.7061 6.7300 6.6402 3.6339 3.2850 1.4013 1.5479 6.1838 6.1556 1.5814 1.6113 1.3320 1.3363 8.3803 8.8223 7.1641 2.9576 2.7484 1.9686 1.3283 1.3022 1.2597 1.2644 1.5924 1.5324 1.4424 1.4254 1.3960 1.7323 1.5868 1.9073 2.9022 1.6785 2.3266 2.6192 4.7820 6.9678 2.7986 3.2447 1.2288 1.1904 1.3152 1.2907 1.1242 1.0742 1.0506 1.0506 1.2788 1.0643 1.5241 1.0602 1.1485 3.1990 8.2413 7.8434 7.0580 6.9707 1.0330 1.0331 1.0291 1.0291 1.1038 1.1039 1.1040 1.1038 1.1047 1.1047 1.0990 1.0991 1.0890 1.0887 1.0943 1.0944 1.0921 1.0921
irintensity: 0.0062 1.9974 2.0605 12.9932 3.9723 6.5743 0.3385 0.8305 0.3502 0.1407 0.1608 3.8241 6.6207 1.2995 0.0108 0.3250 1.2766 4.7292 5.0264 7.0341 0.8935 0.0320 1.7814 0.1563 2.1777 8.0167 1.7160 5.5009 36.6014 3.7812 16.1475 4.8612 5.9049 7.9286 5.3043 3.3335 0.8693 5.1321 51.0815 11.6924 1.9188 0.1114 50.2716 23.6151 0.8190 1.3792 3.5819 1.6546 14.7668 35.6251 147.8868 70.7093 28.9363 14.4873 0.9810 1.6922 166.2168 6.5029 14.3916 131.6480 12.8482 46.1245 175.5455 12.6445 91.6472 90.5683 4.4329 5.3332 78.4127 89.3963 7.5315 10.1179 55.6896 0.0945 0.0201 20.3179 18.5488 0.0241 14.4422 11.2883 234.7197 8.5668 52.1363 36.3631 14.7341 43.2553 40.5724 56.7861 39.5777 312.3864 89.8074 65.6606 90.0529 23.9145 23.1566 75.9478 3.8130 48.5637 43.6866 10.7597 60.7917 2.4366 10.7416 2.4763 11.5164 12.6529 1.4387 0.0224
temp: 298.150 k
press: 1.00000 atm
elementType: 8 8 8 8 6 6 6 6 6 6 6 6 6 6 6 6 6 6 6 6 1 1 1 1 1 1 1 1 1 1 1 1 1 1 1 1 1 1
symmnumber: 1
zpe: 794246.5 jmol-1
zpe.correction: 0.302513 hartree
zpe.thermalcorrener: 0.322963 hartree
zpe.thermalcorrenthalpy: 0.323908 hartree
zpe.thermalcorrgfe: 0.253060 hartree
zpe.sumelectzpe: -919.852168 hartree
zpe.sumelectthermal: -919.831717 hartree
zpe.sumelectthermalent: -919.830773 hartree
zpe.sumelectthermalfe: -919.901620 hartree
dipole: 0.0014 -4.0826 -0.0060
dipole: 4.0826
quadrupole: -101.1932 -111.7350 -113.7818
quadrupole: -0.0074 12.5536 -0.0103
quadrupole: 7.7102 -2.8317 -4.8785 -0.0074 12.5536 -0.0103
hfenergy: -920.1546803 hartree
pointgroup: C01 [X(C16H18O4)]
dipole: -0.0008297 -0.0013759 -1.6062189 debye
polarizability: 299.7930132|-21.6535383|129.1870543|-0.0172917|0.0045624|172.7401568 unknown
InChI: InChI=1S/C16H18O4/c1-17-11-5-7-13(15(9-11)19-3)14-8-6-12(18-2)10-16(14)20-4/h5-10H,1-4H3
charge 0 multiplicity 1
38 atoms
O  -1.143255 -1.205469 1.895498
O  1.143087 1.20596 1.894618
O  -5.013848 0.174992 -0.431816
O  5.014423 -0.173316 -0.432574
C  -0.749116 0.001736 -0.292725
C  0.749632 -0.002355 -0.292804
C  -1.584891 -0.569398 0.722327
C  1.585263 0.569803 0.721718
C  -1.413573 0.595649 -1.400005
C  1.414185 -0.596524 -1.399885
C  -2.991989 -0.478942 0.636555
C  2.9924 0.480173 0.63577
C  -3.610374 0.14886 -0.464456
C  3.610929 -0.147987 -0.464965
C  -2.815853 0.683951 -1.510228
C  2.816502 -0.684162 -1.510267
C  0.064594 -2.05202 1.883962
C  -0.066264 2.050334 1.882584
C  -5.702471 0.790021 -1.568352
C  5.703175 -0.78867 -1.568857
H  -0.792181 1.04018 -2.18618
H  0.792887 -1.041708 -2.185764
H  -3.601774 -0.922601 1.427604
H  3.602059 0.924622 1.426472
H  -3.262397 1.171282 -2.381071
H  3.263162 -1.171726 -2.380921
H  -0.125502 -2.824894 2.646336
H  0.954548 -1.464477 2.161027
H  0.216805 -2.524354 0.89728
H  -0.219404 2.521626 0.895543
H  0.122458 2.824122 2.64437
H  -0.955125 1.461324 2.160104
H  -6.774173 0.695909 -1.339387
H  -5.475322 0.259637 -2.51384
H  -5.43605 1.860192 -1.671299
H  5.475542 -0.259009 -2.514634
H  5.437341 -1.859055 -1.671079
H  6.774868 -0.693807 -1.340159
