program: Gaussian 09
title: 000266846
version: EM64L-G09RevD.01
frameworkgroup: C1[X(C16H18O4)]
method: RPBEPBE
basis: SDD
operation: Freq
keyword: #pfreq=noraman
keyword: PBEPBE/SDD
title: #p freq=noraman PBEPBE/SDD
converged: YES YES NO NO
title: Mulliken charges:
elementType: O O O O C C C C C C C C C C C C C C C C H H H H H H H H H H H H H H H H H H
charge: -0.305906 -0.305906 -0.298661 -0.298661 0.387216 0.387214 -0.523117 -0.523112 -0.399783 -0.399784 0.209680 0.209675 0.185316 0.185312 -0.353314 -0.353309 -0.530560 -0.530555 -0.529943 -0.529939 0.259002 0.259002 0.238916 0.238917 0.248377 0.248377 0.223286 0.252604 0.229517 0.223285 0.252601 0.229517 0.223159 0.255149 0.229062 0.229062 0.223159 0.255145
chargesum: 0.00000
title: Mulliken charges with hydrogens summed into heavy atoms:
elementType: O O O O C C C C C C C C C C C C C C C C
charge: -0.305906 -0.305906 -0.298661 -0.298661 0.387216 0.387214 -0.264116 -0.264110 -0.160867 -0.160867 0.209680 0.209675 0.185316 0.185312 -0.104937 -0.104932 0.174848 0.174849 0.177427 0.177427
polarizability: 3.22359415e+02 -2.76031892e-04 1.88403269e+02 1.83169887e-01 5.93717987e-04 1.04849067e+02
1716.lowfreq: -5.6730 -2.9480 -0.0006 -0.0003 -0.0002 5.0283 31.6783 37.4230 52.1319
frequency: 31.6721 37.4041 52.1319 84.7217 94.7535 105.1661 108.9585 115.5950 131.1716 147.8879 148.8607 161.0304 161.4209 176.2041 196.3618 223.3379 244.7378 251.0198 285.4329 297.1341 348.3387 349.6309 369.1922 416.6897 442.0658 463.9615 485.7891 496.4109 544.3703 575.2588 588.4067 614.5602 659.3799 676.1970 711.8004 714.1678 746.0843 746.6895 798.3839 826.5123 838.5264 866.8805 893.6519 903.8128 940.8253 943.9811 949.5204 954.4901 958.8926 980.3972 1034.3341 1089.9626 1098.3928 1113.6358 1114.0475 1114.9336 1115.0108 1149.2923 1151.4255 1153.9554 1155.7412 1162.0146 1172.3904 1219.8849 1223.6609 1247.3388 1257.7144 1301.8109 1336.0164 1358.6578 1398.9463 1402.7920 1422.3151 1425.7056 1439.0567 1443.9263 1456.6345 1456.6721 1457.9484 1459.1440 1472.4833 1477.5196 1477.8159 1488.3361 1488.4511 1503.9015 1555.5368 1571.5842 1611.1297 1613.5982 2971.0136 2971.0397 2972.7125 2973.1598 3067.1564 3067.2137 3069.3807 3069.3915 3120.1825 3120.2189 3121.2622 3121.3093 3138.2667 3142.2487 3152.3212 3156.9605 3164.0076 3165.9313
redmass: 4.1355 4.2196 3.6962 3.5843 4.0123 2.8403 2.7813 3.2850 2.7799 1.1672 1.1361 1.0848 1.1854 2.4383 3.4061 5.5251 5.7574 5.2490 7.0361 4.9185 4.4241 4.6715 4.8792 5.3977 4.8595 4.7389 3.3907 3.7203 7.2516 5.4557 4.8513 4.3079 5.8636 3.5099 5.7432 6.2393 3.2349 3.4538 6.5742 1.4375 1.5779 4.9821 1.4892 1.6885 7.8000 3.5121 1.5054 1.8060 5.9678 4.4085 1.9637 3.0412 2.4049 1.2419 1.2397 1.2396 1.2406 1.3648 1.3352 1.3008 1.3372 1.6842 2.0552 1.9634 3.1496 1.4469 1.6473 2.6242 5.3628 9.3266 4.1972 2.3233 1.1905 1.1667 1.2947 1.3984 1.0603 1.0525 1.0915 1.0626 2.3971 1.0579 1.0643 1.0524 1.0535 3.4333 6.4284 8.1380 6.4559 6.8427 1.0308 1.0308 1.0309 1.0310 1.1038 1.1038 1.1041 1.1041 1.1027 1.1027 1.1028 1.1028 1.0880 1.0873 1.0915 1.0906 1.0964 1.0964
irintensity: 0.0672 1.0138 1.6495 3.9360 2.0516 0.1148 13.8797 5.8348 0.6976 0.4821 0.0218 0.0506 0.3756 12.3472 6.8504 0.8118 0.0646 13.1433 5.3608 8.3129 0.2570 0.3478 2.4339 0.9281 0.4872 26.9858 0.0085 6.7729 15.0853 11.6785 1.5455 20.3990 6.7558 0.2435 26.1100 0.8039 1.9069 9.9642 13.8298 76.2762 9.9063 0.4716 29.9800 3.0241 135.4702 1.0193 8.6195 5.2549 71.5342 55.7929 25.0886 87.0649 30.2939 36.3269 3.5493 3.4085 1.9547 1.6862 3.8816 0.3735 1.5950 18.0137 14.8468 5.7718 337.8701 29.8272 16.4769 4.5632 50.6609 21.8697 14.7963 2.0179 15.5020 1.2752 7.3678 7.9693 28.1638 20.3004 31.1615 1.9197 338.9617 5.8204 7.5362 36.3924 5.1036 19.3347 21.2837 5.1143 6.4806 4.8126 55.8277 116.6824 137.9307 9.1376 38.9825 24.4271 15.6509 27.4244 21.2906 27.6878 56.8010 0.0906 15.2166 1.2080 3.9913 8.2765 2.3702 11.5411
temp: 298.150 k
press: 1.00000 atm
elementType: 8 8 8 8 6 6 6 6 6 6 6 6 6 6 6 6 6 6 6 6 1 1 1 1 1 1 1 1 1 1 1 1 1 1 1 1 1 1
symmnumber: 1
zpe: 793228.0 jmol-1
zpe.correction: 0.302125 hartree
zpe.thermalcorrener: 0.322761 hartree
zpe.thermalcorrenthalpy: 0.323705 hartree
zpe.thermalcorrgfe: 0.252291 hartree
zpe.sumelectzpe: -919.847899 hartree
zpe.sumelectthermal: -919.827262 hartree
zpe.sumelectthermalent: -919.826318 hartree
zpe.sumelectthermalfe: -919.897732 hartree
dipole: -0.0001 0.5292 0.0000
dipole: 0.5292
quadrupole: -96.7213 -107.7024 -120.7142
quadrupole: -0.0005 5.3010 -0.0001
quadrupole: 11.6580 0.6769 -12.3349 -0.0005 5.3010 -0.0001
hfenergy: -920.1500232 hartree
pointgroup: C01 [X(C16H18O4)]
dipole: -0.0000283 0.2081948 -0.0000034 debye
polarizability: 322.3594574|-0.0007655|188.4032694|-0.155861|-0.0017724|104.8490246 unknown
InChI: InChI=1S/C16H18O4/c1-17-13-7-5-11(9-15(13)19-3)12-6-8-14(18-2)16(10-12)20-4/h5-10H,1-4H3
charge 0 multiplicity 1
38 atoms
O  -3.582672 1.79233 -0.390828
O  3.582683 1.792349 0.390745
O  -5.008786 -0.660461 0.353587
O  5.008803 -0.660499 -0.353536
C  -0.743338 -0.600614 0.056372
C  0.743354 -0.600618 -0.056343
C  -1.497877 0.575148 -0.201872
C  1.497895 0.575152 0.201857
C  -1.451681 -1.773617 0.439645
C  1.451694 -1.773636 -0.439577
C  -2.902043 0.585616 -0.096302
C  2.902061 0.585615 0.096283
C  -3.599978 -0.61076 0.239241
C  3.599994 -0.610777 -0.23921
C  -2.858511 -1.777468 0.523532
C  2.858523 -1.777492 -0.523463
C  -4.327277 2.369417 0.753075
C  4.327239 2.369417 -0.753202
C  -5.742289 -0.381064 -0.904382
C  5.742298 -0.38112 0.904443
H  -1.009877 1.505554 -0.509815
H  1.009896 1.505572 0.509761
H  -0.899444 -2.684536 0.693193
H  0.899455 -2.684563 -0.69309
H  -3.40725 -2.680598 0.809396
H  3.40726 -2.680636 -0.809289
H  -3.623642 2.654926 1.557936
H  -5.07147 1.652342 1.144398
H  -4.826061 3.266414 0.355484
H  3.623569 2.654891 -1.558045
H  5.07143 1.652344 -1.144534
H  4.826021 3.266433 -0.355654
H  -5.523554 -1.167153 -1.651684
H  -5.467697 0.60863 -1.311233
H  -6.808608 -0.407665 -0.632928
H  6.80862 -0.40773 0.632999
H  5.523549 -1.167214 1.651735
H  5.467714 0.608572 1.311303
